program: Gaussian 09
title: 000056131
version: EM64L-G09RevD.01
frameworkgroup: C1[X(C10H9I3O3)]
method: RPBEPBE
basis: SDD
operation: Freq
keyword: #p
keyword: freq=noraman
keyword: PBEPBE/SDD
title: #p freq=noraman PBEPBE/SDD
converged: NO YES NO NO
title: Mulliken charges:
elementType: I I I O O O C C C C C C C C C C H H H H H H H H H
charge: 0.149611 0.144723 0.157507 -0.249012 -0.415883 -0.222184 -0.396732 -0.296249 -0.472402 0.554041 -0.563626 -0.219316 0.181641 -0.296965 -0.075018 -0.337587 0.243483 0.243941 0.213425 0.213711 0.250755 0.250675 0.281830 0.278353 0.381279
chargesum: 0.00000
title: Mulliken charges with hydrogens summed into heavy atoms:
elementType: I I I O O O C C C C C C C C C C
charge: 0.149611 0.144723 0.157507 -0.249012 -0.034604 -0.222184 0.090692 0.130887 0.029028 0.554041 -0.563626 0.062513 0.181641 -0.296965 0.203335 -0.337587
polarizability: 2.79125017e+02 -2.86936845e+01 2.29720359e+02 -6.30716019e-01 -1.99123312e-01 7.32924404e+01
1716.lowfreq: -2.1899 -0.0006 -0.0003 -0.0003 1.3314 4.7986 14.0017 17.0265 29.8992
frequency: 13.9823 16.8779 29.8723 41.4012 72.6140 85.8063 89.9844 92.1531 110.3456 121.6067 145.7116 148.9962 154.9229 202.6644 244.6153 285.1437 328.3480 373.2210 377.9252 438.0042 474.6599 503.0534 528.7705 587.8725 588.1279 619.8854 640.2163 669.7039 691.2493 764.6667 817.8118 841.8968 865.8934 876.9816 882.7885 968.5927 1002.9243 1030.0540 1080.6435 1093.6013 1098.2203 1100.9751 1169.1694 1212.1716 1243.7202 1258.1869 1265.0803 1287.7606 1296.0282 1297.8724 1349.6225 1369.6939 1394.6927 1430.6267 1442.5343 1471.0385 1485.0363 1522.3528 1559.4752 1672.5391 2948.5048 2991.1694 3008.7509 3029.5632 3038.8396 3095.4034 3170.9510 3176.4013 3515.7864
redmass: 16.6608 13.9822 13.4724 6.8670 3.4274 30.7205 2.2184 27.2732 7.8228 3.7979 14.6778 2.8759 52.3696 5.4680 6.7972 9.0731 11.2663 5.6014 9.4068 3.0543 4.4403 1.8257 5.4658 5.9750 7.7174 7.1304 1.3154 8.2119 3.3618 1.1944 8.7593 1.5887 5.1551 1.3434 1.3725 8.1479 7.0940 3.1527 2.1929 1.7203 2.5597 2.9012 1.1777 3.5192 1.4290 1.2621 1.1917 1.0763 1.5941 7.4092 5.8846 1.7096 1.6942 2.6299 1.0874 1.0910 1.1054 8.6304 7.4395 8.3967 1.0550 1.0608 1.1073 1.0604 1.0990 1.1043 1.0925 1.0912 1.0640
irintensity: 0.7688 0.7700 0.2445 0.1280 2.2941 0.0342 0.0065 0.2797 0.2860 0.4456 0.1523 2.9262 0.0380 0.0376 4.0416 1.4574 1.8443 3.7826 2.3612 15.0479 43.6881 29.6894 1.1874 22.4539 10.4468 36.8959 134.5236 17.9660 1.3058 17.5240 29.0915 12.4132 3.6916 0.3143 27.6717 49.0177 215.6914 187.6394 5.5245 0.5442 41.0392 68.4581 1.5482 165.2611 4.7680 4.2198 0.1603 0.1123 23.1043 243.6004 19.8983 84.5356 6.0586 239.3935 24.1786 6.0527 9.4575 4.6065 40.4153 203.5046 31.7776 11.4007 29.9891 8.4328 3.4002 26.2351 0.2088 3.4730 26.6936
temp: 298.150 k
press: 1.00000 atm
elementType: 53 53 53 8 8 8 6 6 6 6 6 6 6 6 6 6 1 1 1 1 1 1 1 1 1
symmnumber: 1
zpe: 441456.5 jmol-1
zpe.correction: 0.168142 hartree
zpe.thermalcorrener: 0.186058 hartree
zpe.thermalcorrenthalpy: 0.187003 hartree
zpe.thermalcorrgfe: 0.114363 hartree
zpe.sumelectzpe: -645.457962 hartree
zpe.sumelectthermal: -645.440046 hartree
zpe.sumelectthermalent: -645.439101 hartree
zpe.sumelectthermalfe: -645.511741 hartree
dipole: -1.8220 -3.0403 -0.0133
dipole: 3.5445
quadrupole: -129.2007 -130.7666 -139.3002
quadrupole: 17.4694 0.1085 -0.1125
quadrupole: 3.8885 2.3226 -6.2111 17.4694 0.1085 -0.1125
hfenergy: -645.6261039 hartree
pointgroup: C01 [X(C10H9I3O3)]
dipole: -0.9221799 -1.0396236 -0.1159199 debye
dipolederiv: -0.0407482 0.1700903 0.0164604 0.2502113 -0.3795763 -0.0399748 0.0236868 -0.0398472 0.0373683 0.0073709 0.1083036 0.0100742 0.2058481 -0.4580926 -0.0460667 0.0197784 -0.0485096 0.0328075 -0.4803158 0.0389219 0.0036748 -0.0123003 0.0601653 0.0012125 0.0002316 0.0008747 0.0466646 -2.1776923 -0.2145385 -0.0331611 -0.1595914 -0.276011 -0.003078 -0.0241229 -0.0038502 -0.2601246 -0.9803347 -0.5599276 -0.0746862 -0.5423556 -0.7308443 -0.0469815 -0.0765046 -0.0485072 -0.4379307 -0.740635 0.1792769 0.0115282 -0.0739899 -0.9101368 -0.0713198 -0.0193419 -0.0647297 -0.3075198 -0.0113445 -0.0020707 -0.0028712 -0.0445005 0.0317678 -0.0076749 -0.0067472 -0.008831 0.118495 0.9874992 0.1906311 0.0234694 0.6038807 0.3701514 0.000549 0.0645608 -0.0006325 0.3955993 -0.3512836 0.077603 -0.0031002 0.3548556 -0.0363238 -0.0151201 0.0219767 -0.0188194 0.1610096 1.6770246 0.3748709 0.0439373 -0.3363755 -0.2392651 -0.0431472 -0.0288189 -0.0394728 0.1677274 -0.2379858 -0.3889601 -0.0399059 -0.52817 0.9340578 0.1091267 -0.0527874 0.1088217 -0.1962116 -0.3778191 -0.122621 -0.0137838 0.4194018 -0.3550773 -0.0182775 0.0390203 -0.0213857 -0.1437345 1.5803483 0.1887272 0.0538627 0.2605828 1.3861479 0.1429416 0.0687662 0.140489 0.205561 -0.104235 -0.3037018 -0.0275292 -0.1784296 1.0781642 0.1111895 -0.0159298 0.1149866 -0.105541 -0.2562929 -0.0295944 -0.0017834 0.136267 -0.2012527 -0.0187354 0.0139578 -0.0179517 -0.0159116 0.9513662 0.2191981 0.0187753 -0.1087626 -0.5065442 -0.0325237 -0.0131326 -0.0329592 -0.156803 0.0857674 -0.0030678 -0.0135452 0.0093757 0.002734 0.0848408 -0.0055725 0.0797912 -0.0184624 0.0837029 -0.0029919 0.0172745 0.0110192 0.0348043 -0.0736601 0.0125804 -0.0690943 -0.0493252 -0.0261365 0.0149547 0.0447964 -0.1097499 -0.0362212 -0.0828392 0.0075411 -0.0969821 -0.0965452 -0.0257742 0.0201958 -0.0391014 -0.1089435 -0.0720929 0.0868088 -0.0276902 0.1024514 -0.0620897 0.0775164 0.0162573 -0.0098624 -0.0381701 0.0126322 0.08415 -0.005733 0.1033407 0.006077 0.0770455 0.0180534 0.0171617 -0.035309 0.0490106 -0.0771543 0.00412 -0.0942662 -0.0296235 0.0304711 -0.0517878 -0.0043559 -0.0835499 0.0023544 -0.0154827 -0.0080284 -0.0147657 0.1615738 0.0585821 -0.0391201 -0.0038338 -0.046434 0.0158413 -0.0130739 -0.0040685 -0.0132498 0.1532755 0.193903 0.1012973 0.0065048 0.1551897 0.2236069 -0.0157091 0.012258 -0.0169011 0.3936638 unknown
polarizability: 267.2349469|-35.5542412|240.0605243|-2.4716228|16.0648004|74.8423456 unknown
InChI: InChI=1S/C10H9I3O3/c11-6-4-8(13)9(5-7(6)12)16-3-1-2-10(14)15/h4-5,14H,1-3H2
charge 0 multiplicity 1
25 atoms
I  1.084898 3.520107 0.353058
I  3.6743 -3.071553 -0.269172
I  5.979468 -0.088287 0.008214
O  -0.350659 0.69193 0.07885
O  -6.112353 -1.429372 -0.260571
O  -5.510913 0.798675 0.007915
C  -2.694716 0.151238 -0.008691
C  -1.286267 -0.444354 -0.044469
C  -3.760451 -0.952638 -0.144087
C  1.014948 0.433421 0.058214
C  1.890162 1.549238 0.165028
C  1.573059 -0.863704 -0.061773
C  -5.172509 -0.396728 -0.118737
C  2.974983 -1.050382 -0.078511
C  3.283391 1.362179 0.148108
C  3.841022 0.062079 0.025523
H  -2.802475 0.887717 -0.82415
H  -2.836964 0.705016 0.935627
H  -1.095714 -0.975609 -1.000603
H  -1.12278 -1.149247 0.797641
H  -3.680366 -1.699007 0.670919
H  -3.640776 -1.522603 -1.086343
H  0.919653 -1.73489 -0.14261
H  3.945257 2.227811 0.229452
H  -7.030399 -1.044037 -0.240133
