program: Orca
programVersion: 5.0.2
elementType: Cl O O N C C C C C C C C C C C C C C C C H H H H H H H H H H H H H H H H H H H H H H
charge: 0
multiplicity: 1
keywords: wb97x-d3
keywords: def2-TZVPP
keywords: def2/J RIJCOSX
keywords: DEFGRID2
keywords: scfconv7
keywords: smallprint printgap noloewdin
keywords: NOSOSCF
formula: C16H22ClNO2
InChI: InChI=1/C16H22ClNO2/c1-4-20-11-10-18(15(19)12-17)16(13(2)3)14-8-6-5-7-9-14/h5-9H,4,10-12H2,1-3H3
42 atoms
Cl -0.319524 4.132482 -0.326391
O  -1.995447 -1.874759 0.185068
O  -1.06857 2.309754 2.00745
N  -0.299761 0.51546 0.862855
C  0.334721 -0.034485 -0.291728
C  -0.955864 -0.427644 1.765524
C  -0.150091 0.196787 -1.520571
C  1.501673 -0.890722 0.012285
C  -2.262389 -0.980555 1.238309
C  -0.361784 1.838592 1.126731
C  -1.412802 0.958067 -1.780218
C  0.528818 -0.26837 -2.771696
C  1.607443 -2.176726 -0.517868
C  2.49379 -0.444935 0.886854
C  0.57994 2.749946 0.361136
C  -3.139415 -2.26996 -0.540881
C  2.698043 -2.980126 -0.216291
C  3.582859 -1.248093 1.19031
C  3.691084 -2.517422 0.636246
C  -2.700189 -3.10946 -1.717428
H  -1.139869 0.063902 2.717951
H  -0.263425 -1.248554 1.96533
H  -2.780544 -1.489754 2.06265
H  -2.914993 -0.161349 0.908827
H  -2.02815 1.123194 -0.898796
H  -1.195085 1.931825 -2.225488
H  -2.016245 0.416964 -2.513576
H  1.553448 -0.599419 -2.6218
H  -0.029322 -1.090374 -3.227488
H  0.539183 0.540469 -3.505813
H  0.824747 -2.557968 -1.162326
H  2.421647 0.540891 1.330763
H  1.295528 3.151443 1.079044
H  1.129483 2.275083 -0.443215
H  -3.692373 -1.388833 -0.891749
H  -3.82547 -2.840141 0.09967
H  2.764219 -3.974532 -0.638441
H  4.348218 -0.882466 1.862572
H  4.53965 -3.145303 0.874724
H  -2.061007 -2.540772 -2.395586
H  -3.571095 -3.442412 -2.281497
H  -2.154677 -3.997044 -1.394459
elementType: Cl O N C H
totalener: -1288.44050449 hartree
nucrepener: 1792.96504493 hartree
electener: -3081.40554942 hartree
oneelecener: -5324.52301673 hartree
twoeener: 2243.11746731 hartree
cpcmener: -0.03536075 hartree
kineticenergy: 1283.98289541 hartree
xcener: -102.814214573937 hartree
chargesum: 0.0000000
charge: -0.164861 -0.369723 -0.542936 -0.020414 0.064085 -0.038750 0.067407 -0.007132 -0.022273 0.316783 -0.326033 -0.259531 -0.280206 -0.195856 -0.086601 0.032228 -0.165084 -0.168365 -0.154261 -0.264833 0.104421 0.108608 0.105788 0.093449 0.106774 0.113263 0.114848 0.104629 0.107420 0.109858 0.150444 0.147022 0.159633 0.149048 0.080453 0.089043 0.158231 0.157987 0.161109 0.078906 0.098316 0.087104
qa: -0.1649 -0.3697 -0.5429 -0.0204 0.0641 -0.0387 0.0674 -0.0071 -0.0223 0.3168 -0.3260 -0.2595 -0.2802 -0.1959 -0.0866 0.0322 -0.1651 -0.1684 -0.1543 -0.2648 0.1044 0.1086 0.1058 0.0934 0.1068 0.1133 0.1148 0.1046 0.1074 0.1099 0.1504 0.1470 0.1596 0.1490 0.0805 0.0890 0.1582 0.1580 0.1611 0.0789 0.0983 0.0871
va: 1.1089 1.9151 1.9664 3.0097 3.4848 3.8270 3.6220 3.3412 3.9312 4.1142 3.9583 3.9118 3.9935 3.9265 3.9730 3.8772 3.9373 3.9272 3.8889 3.9446 1.0346 1.0081 1.0012 0.9947 1.0025 1.0112 0.9978 1.0035 0.9937 0.9979 0.9974 1.0103 1.0018 1.0089 0.9874 0.9925 0.9926 0.9937 0.9892 1.0009 1.0101 1.0043
dispcorr: -0.025013655 hartree
energy: -1288.465518147434
dipole: -7.33937 7.92556 0.58618 -23.77798 21.78462 -1.99336 -10.02744 8.80877 -1.21867
magnitude: 2.40878 au
magnitude: 6.12264 debye
