program: Orca
programVersion: 5.0.2
elementType: Cl O O N C C C C C C C C C C C C C C C C H H H H H H H H H H H H H H H H H H H H H H
charge: 0
multiplicity: 1
keywords: wb97x-d3
keywords: def2-TZVPP
keywords: def2/J RIJCOSX
keywords: DEFGRID2
keywords: scfconv7
keywords: smallprint printgap noloewdin
keywords: NOSOSCF
formula: C16H22ClNO2
InChI: InChI=1/C16H22ClNO2/c1-4-20-11-10-18(15(19)12-17)16(13(2)3)14-8-6-5-7-9-14/h5-9H,4,10-12H2,1-3H3
42 atoms
Cl -0.347377 4.190235 -0.247988
O  -2.639961 -1.372123 -0.08137
O  -1.24807 2.25926 1.920068
N  -0.41765 0.500133 0.775348
C  0.291183 -0.034118 -0.340493
C  -1.129004 -0.445417 1.629844
C  -0.081056 0.2516 -1.598453
C  1.430859 -0.902351 0.032271
C  -2.547727 -0.751418 1.176134
C  -0.491498 1.819207 1.07096
C  -1.296365 1.0593 -1.934571
C  0.70479 -0.163451 -2.805143
C  1.614942 -2.153661 -0.556716
C  2.321646 -0.500697 1.02964
C  0.495989 2.75132 0.389931
C  -2.25004 -2.728482 -0.097622
C  2.674691 -2.967271 -0.182677
C  3.381924 -1.312318 1.402959
C  3.564266 -2.548281 0.79648
C  -2.426545 -3.271935 -1.495745
H  -1.175203 -0.049959 2.644215
H  -0.532675 -1.357422 1.68599
H  -3.020384 -1.367624 1.954636
H  -3.120545 0.175982 1.111908
H  -1.857112 0.558424 -2.727678
H  -1.975418 1.221408 -1.101864
H  -1.013388 2.036568 -2.333001
H  0.186467 -0.952236 -3.356437
H  0.791925 0.682561 -3.491342
H  1.709309 -0.514413 -2.580822
H  0.913469 -2.503649 -1.303883
H  2.19082 0.457123 1.519152
H  1.194329 3.095922 1.153389
H  1.065546 2.310063 -0.41976
H  -2.858221 -3.305805 0.612581
H  -1.204647 -2.850033 0.212555
H  2.797608 -3.935521 -0.651037
H  4.06692 -0.979223 2.172291
H  4.388922 -3.184096 1.09218
H  -3.464476 -3.204595 -1.82499
H  -2.135468 -4.322329 -1.522558
H  -1.804634 -2.737171 -2.215921
elementType: Cl O N C H
totalener: -1288.45052900 hartree
nucrepener: 1797.32358708 hartree
electener: -3085.77411608 hartree
oneelecener: -5332.78117549 hartree
twoeener: 2247.00705941 hartree
cpcmener: -0.02946094 hartree
kineticenergy: 1283.97486279 hartree
xcener: -102.812959515412 hartree
chargesum: 0.0000000
charge: -0.161235 -0.378786 -0.503000 -0.009218 0.088718 -0.085345 0.040789 0.028662 0.007148 0.293825 -0.313394 -0.260411 -0.332226 -0.213822 -0.084618 0.036337 -0.134324 -0.152374 -0.160884 -0.262039 0.103078 0.119241 0.097254 0.101751 0.114848 0.101906 0.105734 0.106846 0.107681 0.105113 0.153323 0.142275 0.156191 0.147514 0.090964 0.077402 0.155292 0.154414 0.157310 0.090547 0.089853 0.077660
qa: -0.1612 -0.3788 -0.5030 -0.0092 0.0887 -0.0853 0.0408 0.0287 0.0071 0.2938 -0.3134 -0.2604 -0.3322 -0.2138 -0.0846 0.0363 -0.1343 -0.1524 -0.1609 -0.2620 0.1031 0.1192 0.0973 0.1018 0.1148 0.1019 0.1057 0.1068 0.1077 0.1051 0.1533 0.1423 0.1562 0.1475 0.0910 0.0774 0.1553 0.1544 0.1573 0.0905 0.0899 0.0777
va: 1.1111 1.9103 2.0135 2.9799 3.4716 3.8013 3.6278 3.2916 3.8856 4.1371 3.9782 3.9130 3.9748 3.9537 3.9812 3.8768 3.9206 3.9215 3.9114 3.9516 1.0350 0.9902 1.0051 1.0082 0.9985 1.0079 1.0098 0.9953 0.9986 1.0037 0.9927 1.0125 1.0026 1.0070 0.9961 0.9735 0.9928 0.9946 0.9905 1.0068 1.0082 1.0014
dispcorr: -0.025417099 hartree
energy: -1288.475946100866
dipole: -3.49002 5.02819 1.53817 -25.44226 23.01437 -2.42789 -8.70294 8.01171 -0.69123
magnitude: 2.95608 au
magnitude: 7.51375 debye
