program: Orca
programVersion: 5.0.2
elementType: Cl O O N C C C C C C C C C C C C C C C C H H H H H H H H H H H H H H H H H H H H H H
charge: 0
multiplicity: 1
keywords: wb97x-d3
keywords: def2-TZVPP
keywords: def2/J RIJCOSX
keywords: DEFGRID2
keywords: scfconv7
keywords: smallprint printgap noloewdin
keywords: NOSOSCF
formula: C16H22ClNO2
InChI: InChI=1/C16H22ClNO2/c1-4-20-11-10-18(15(19)12-17)16(13(2)3)14-8-6-5-7-9-14/h5-9H,4,10-12H2,1-3H3
42 atoms
Cl 0.879429 3.851889 1.294278
O  -2.249984 -1.850114 -0.0914
O  -1.52924 2.113579 1.848445
N  -0.543719 0.472407 0.649649
C  0.172655 0.040283 -0.502542
C  -1.084604 -0.557809 1.530251
C  -0.287432 0.274357 -1.741035
C  1.420266 -0.692274 -0.190285
C  -2.42368 -1.108036 1.087758
C  -0.780836 1.771024 0.948214
C  -1.609215 0.918605 -2.022835
C  0.492111 -0.050017 -2.978582
C  2.349354 -0.150796 0.699357
C  1.664542 -1.955312 -0.727327
C  -0.041129 2.828695 0.146678
C  -3.451236 -2.346265 -0.635719
C  3.509414 -0.841755 1.015245
C  2.824273 -2.647782 -0.410221
C  3.751394 -2.092153 0.460584
C  -3.133608 -3.116394 -1.895817
H  -1.183365 -0.152506 2.535529
H  -0.358414 -1.371001 1.588613
H  -2.819154 -1.740703 1.895781
H  -3.143016 -0.290107 0.944329
H  -1.47246 1.930025 -2.415976
H  -2.130528 0.360031 -2.804305
H  -2.273845 0.982732 -1.163957
H  0.478347 0.806487 -3.657436
H  1.531453 -0.308293 -2.790268
H  0.03054 -0.878997 -3.521313
H  2.169866 0.821865 1.143073
H  0.932636 -2.406169 -1.386216
H  0.66774 2.445058 -0.57797
H  -0.758046 3.470603 -0.362698
H  -4.142281 -1.522148 -0.860871
H  -3.962527 -2.997611 0.086908
H  4.225454 -0.403658 1.698852
H  2.996414 -3.629084 -0.833804
H  4.654308 -2.633366 0.712846
H  -4.052174 -3.503936 -2.336867
H  -2.478675 -3.964864 -1.691913
H  -2.649222 -2.480589 -2.639377
elementType: Cl O N C H
totalener: -1288.45251837 hartree
nucrepener: 1781.27667267 hartree
electener: -3069.72919104 hartree
oneelecener: -5301.11663773 hartree
twoeener: 2231.38744669 hartree
cpcmener: -0.02845875 hartree
kineticenergy: 1283.97931282 hartree
xcener: -102.810051113635 hartree
chargesum: -0.0000000
charge: -0.165108 -0.352763 -0.504911 -0.013522 0.088332 -0.041723 0.050069 -0.033401 -0.018647 0.299080 -0.326817 -0.262212 -0.183337 -0.270904 -0.095491 0.031908 -0.165700 -0.152334 -0.150318 -0.258614 0.103425 0.108180 0.100175 0.090057 0.121325 0.111898 0.107638 0.106123 0.102714 0.106936 0.129442 0.148287 0.149339 0.156234 0.077665 0.083505 0.155028 0.155566 0.157427 0.091416 0.084900 0.079132
qa: -0.1651 -0.3528 -0.5049 -0.0135 0.0883 -0.0417 0.0501 -0.0334 -0.0186 0.2991 -0.3268 -0.2622 -0.1833 -0.2709 -0.0955 0.0319 -0.1657 -0.1523 -0.1503 -0.2586 0.1034 0.1082 0.1002 0.0901 0.1213 0.1119 0.1076 0.1061 0.1027 0.1069 0.1294 0.1483 0.1493 0.1562 0.0777 0.0835 0.1550 0.1556 0.1574 0.0914 0.0849 0.0791
va: 1.1077 1.9325 2.0117 3.0030 3.4899 3.8502 3.6419 3.3785 3.9285 4.1253 3.9859 3.9181 3.9214 3.9837 3.9672 3.8791 3.9392 3.9188 3.8925 3.9552 1.0299 1.0074 1.0012 0.9980 0.9955 0.9966 1.0013 0.9979 1.0038 0.9956 1.0276 1.0018 1.0094 1.0050 0.9888 0.9913 0.9938 0.9931 0.9904 1.0099 1.0043 1.0016
dispcorr: -0.024064450 hartree
energy: -1288.476582817243
dipole: -13.45745 13.25639 -0.20107 -22.39778 20.71158 -1.68619 -17.38175 15.38386 -1.99789
magnitude: 2.62207 au
magnitude: 6.66478 debye
