program: Orca
programVersion: 5.0.2
elementType: Cl O O N C C C C C C C C C C C C C C C C H H H H H H H H H H H H H H H H H H H H H H
charge: 0
multiplicity: 1
keywords: wb97x-d3
keywords: def2-TZVPP
keywords: def2/J RIJCOSX
keywords: DEFGRID2
keywords: scfconv7
keywords: smallprint printgap noloewdin
keywords: NOSOSCF
formula: C16H22ClNO2
InChI: InChI=1/C16H22ClNO2/c1-4-20-11-10-18(15(19)12-17)16(13(2)3)14-8-6-5-7-9-14/h5-9H,4,10-12H2,1-3H3
42 atoms
Cl -0.358091 3.669326 1.482213
O  -1.933773 -1.221891 1.203607
O  -2.283979 1.836489 0.285739
N  -0.808141 0.512518 -0.804919
C  0.515054 0.281532 -1.289392
C  -1.810422 -0.512736 -1.072631
C  0.934197 0.874901 -2.41866
C  1.320706 -0.660779 -0.476499
C  -1.784424 -1.686922 -0.112072
C  -1.159172 1.633978 -0.132858
C  0.046028 1.733402 -3.263759
C  2.338408 0.777596 -2.930659
C  2.001608 -1.723175 -1.07245
C  1.37334 -0.537323 0.913702
C  -0.066228 2.683673 0.027189
C  -1.691447 -2.195076 2.197009
C  2.734792 -2.618845 -0.307629
C  2.111744 -1.427511 1.677911
C  2.795455 -2.472888 1.071006
C  -2.78265 -3.241796 2.315084
H  -1.646826 -0.896145 -2.081512
H  -2.794825 -0.04644 -1.065411
H  -2.597783 -2.36339 -0.407321
H  -0.85057 -2.253413 -0.221878
H  0.364497 2.778383 -3.220083
H  0.134048 1.433867 -4.311073
H  -1.006095 1.689522 -2.991016
H  2.391419 0.139079 -3.815828
H  2.679994 1.766586 -3.245316
H  3.047764 0.397163 -2.199246
H  1.940879 -1.864683 -2.144205
H  0.838621 0.259499 1.41542
H  0.934643 2.270728 0.108083
H  -0.084127 3.352095 -0.835148
H  -1.604698 -1.647945 3.138284
H  -0.724151 -2.686099 2.022273
H  3.250275 -3.439098 -0.790788
H  2.146777 -1.307317 2.753262
H  3.36503 -3.172165 1.669655
H  -2.565094 -3.900505 3.157391
H  -2.858548 -3.868923 1.425468
H  -3.756367 -2.783077 2.494491
elementType: Cl O N C H
totalener: -1288.44987447 hartree
nucrepener: 1790.22724244 hartree
electener: -3078.67711691 hartree
oneelecener: -5319.28975365 hartree
twoeener: 2240.61263674 hartree
cpcmener: -0.03526611 hartree
kineticenergy: 1283.97128220 hartree
xcener: -102.812728715393 hartree
chargesum: -0.0000000
charge: -0.163053 -0.371335 -0.491893 -0.032205 -0.007427 -0.036596 0.115206 -0.016002 -0.018204 0.282771 -0.305013 -0.262981 -0.250972 -0.183089 -0.087725 0.052870 -0.155608 -0.206458 -0.123940 -0.262869 0.111899 0.101670 0.111269 0.092311 0.107079 0.113351 0.098870 0.109733 0.103629 0.105248 0.150730 0.136330 0.146780 0.156555 0.091975 0.059135 0.154966 0.154307 0.158003 0.090647 0.084901 0.085139
qa: -0.1631 -0.3713 -0.4919 -0.0322 -0.0074 -0.0366 0.1152 -0.0160 -0.0182 0.2828 -0.3050 -0.2630 -0.2510 -0.1831 -0.0877 0.0529 -0.1556 -0.2065 -0.1239 -0.2629 0.1119 0.1017 0.1113 0.0923 0.1071 0.1134 0.0989 0.1097 0.1036 0.1052 0.1507 0.1363 0.1468 0.1566 0.0920 0.0591 0.1550 0.1543 0.1580 0.0906 0.0849 0.0851
va: 1.1118 1.9285 2.0203 3.0074 3.6259 3.8270 3.6312 3.3797 3.9623 4.1698 3.9756 3.9142 3.9559 3.8632 3.9799 3.8957 3.9202 3.9462 3.8724 3.9210 1.0039 1.0299 0.9963 0.9834 0.9953 0.9980 1.0071 0.9957 0.9995 1.0014 0.9979 1.0156 1.0030 1.0050 0.9904 0.9989 0.9931 0.9963 0.9890 1.0098 0.9998 1.0066
dispcorr: -0.024139961 hartree
energy: -1288.474014434625
dipole: 1.52278 0.50550 2.02828 -21.47072 19.48140 -1.98932 -10.37680 8.21545 -2.16135
magnitude: 3.56970 au
magnitude: 9.07346 debye
