program: Orca
programVersion: 5.0.2
elementType: Cl O O N C C C C C C C C C C C C C C C C H H H H H H H H H H H H H H H H H H H H H H
charge: 0
multiplicity: 1
keywords: wb97x-d3
keywords: def2-TZVPP
keywords: def2/J RIJCOSX
keywords: DEFGRID2
keywords: scfconv7
keywords: smallprint printgap noloewdin
keywords: NOSOSCF
formula: C16H22ClNO2
InChI: InChI=1/C16H22ClNO2/c1-4-20-11-10-18(15(19)12-17)16(13(2)3)14-8-6-5-7-9-14/h5-9H,4,10-12H2,1-3H3
42 atoms
Cl 0.715007 4.01156 1.220975
O  -3.093684 -1.996875 0.64317
O  -1.506923 2.073779 1.376255
N  -0.435434 0.481878 0.189163
C  0.506712 0.094327 -0.806547
C  -1.206226 -0.586869 0.810173
C  0.320398 0.398302 -2.100959
C  1.656887 -0.670286 -0.269288
C  -2.448528 -0.926407 0.003416
C  -0.64359 1.762212 0.575674
C  -0.901879 1.089654 -2.621303
C  1.343991 0.120776 -3.158929
C  2.034042 -1.895469 -0.818037
C  2.352423 -0.195397 0.844287
C  0.266214 2.819479 -0.029434
C  -4.258931 -2.421367 -0.029818
C  3.095608 -2.614147 -0.28733
C  3.417549 -0.909657 1.370776
C  3.79332 -2.121973 0.806651
C  -4.874743 -3.576826 0.721901
H  -1.477315 -0.299579 1.824997
H  -0.564308 -1.466768 0.882472
H  -3.107925 -0.049497 -0.062085
H  -2.165941 -1.197176 -1.024181
H  -0.660142 2.102166 -2.955664
H  -1.273663 0.56057 -3.502326
H  -1.719571 1.159926 -1.90757
H  1.010032 -0.67771 -3.825868
H  1.473371 1.008228 -3.78338
H  2.319602 -0.15511 -2.76639
H  1.480654 -2.299531 -1.656571
H  2.066481 0.743612 1.303491
H  1.186565 2.42936 -0.449641
H  -0.268925 3.352365 -0.812936
H  -4.017409 -2.726658 -1.057327
H  -4.978454 -1.594898 -0.10803
H  3.369187 -3.566574 -0.723061
H  3.952736 -0.520278 2.227351
H  4.619961 -2.683054 1.223006
H  -5.162425 -3.289208 1.733904
H  -4.189273 -4.422654 0.786385
H  -5.772436 -3.915807 0.204653
elementType: Cl O N C H
totalener: -1288.45277226 hartree
nucrepener: 1726.95809735 hartree
electener: -3015.41086960 hartree
oneelecener: -5191.83561741 hartree
twoeener: 2176.42474781 hartree
cpcmener: -0.03116245 hartree
kineticenergy: 1283.97853029 hartree
xcener: -102.810052295134 hartree
chargesum: 0.0000000
charge: -0.163903 -0.377051 -0.497456 -0.048724 0.065444 0.009167 0.100389 -0.076163 -0.008385 0.297478 -0.327256 -0.264947 -0.255400 -0.175857 -0.091322 0.055145 -0.155877 -0.173158 -0.141404 -0.252928 0.099460 0.105907 0.083175 0.090403 0.114121 0.117131 0.102360 0.109865 0.104085 0.103911 0.151875 0.134420 0.149498 0.155936 0.069904 0.071684 0.155409 0.155629 0.158348 0.083453 0.082445 0.083192
qa: -0.1639 -0.3771 -0.4975 -0.0487 0.0654 0.0092 0.1004 -0.0762 -0.0084 0.2975 -0.3273 -0.2649 -0.2554 -0.1759 -0.0913 0.0551 -0.1559 -0.1732 -0.1414 -0.2529 0.0995 0.1059 0.0832 0.0904 0.1141 0.1171 0.1024 0.1099 0.1041 0.1039 0.1519 0.1344 0.1495 0.1559 0.0699 0.0717 0.1554 0.1556 0.1583 0.0835 0.0824 0.0832
va: 1.1090 1.9535 2.0192 3.0152 3.5679 3.7337 3.6028 3.4634 3.9440 4.1378 3.9820 3.9216 3.9672 3.9215 3.9848 3.8835 3.9161 3.9510 3.8889 3.9603 1.0304 1.0125 1.0017 0.9867 0.9957 0.9961 1.0067 0.9955 0.9991 1.0028 0.9992 1.0172 1.0048 1.0052 0.9879 0.9873 0.9937 0.9947 0.9903 1.0045 1.0045 1.0083
dispcorr: -0.021672181 hartree
energy: -1288.474444437073
dipole: -13.08025 13.74796 0.66771 -22.90724 21.42709 -1.48015 -15.40920 12.55556 -2.85365
magnitude: 3.28329 au
magnitude: 8.34546 debye
