program: Orca
programVersion: 5.0.2
elementType: Cl O O N C C C C C C C C C C C C C C C C H H H H H H H H H H H H H H H H H H H H H H
charge: 0
multiplicity: 1
keywords: wb97x-d3
keywords: def2-TZVPP
keywords: def2/J RIJCOSX
keywords: DEFGRID2
keywords: scfconv7
keywords: smallprint printgap noloewdin
keywords: NOSOSCF
formula: C16H22ClNO2
InChI: InChI=1/C16H22ClNO2/c1-4-20-11-10-18(15(19)12-17)16(13(2)3)14-8-6-5-7-9-14/h5-9H,4,10-12H2,1-3H3
42 atoms
Cl -0.436125 4.022306 -0.06192
O  -1.967928 -1.723004 0.913634
O  -2.41391 1.642217 0.5189
N  -0.829349 0.455869 -0.58106
C  0.538942 0.250469 -0.944732
C  -1.805141 -0.487898 -1.118298
C  1.057691 0.910846 -1.992321
C  1.261626 -0.754489 -0.126901
C  -1.765862 -1.855163 -0.466578
C  -1.245561 1.466437 0.211735
C  0.249159 1.818531 -2.865245
C  2.499054 0.829974 -2.391034
C  2.016919 -1.763163 -0.729117
C  1.153577 -0.758346 1.265237
C  -0.197445 2.433956 0.735819
C  -1.779088 -2.928913 1.620788
C  2.664802 -2.724671 0.032147
C  1.808362 -1.713532 2.028509
C  2.566397 -2.702537 1.416324
C  -1.921124 -2.666181 3.100808
H  -1.614824 -0.611554 -2.186814
H  -2.797742 -0.052798 -1.016454
H  -2.550403 -2.4696 -0.932198
H  -0.812373 -2.356117 -0.678799
H  0.372126 1.518291 -3.909598
H  -0.814736 1.826749 -2.642458
H  0.616792 2.844659 -2.79826
H  3.145829 0.408824 -1.624927
H  2.6223 0.236178 -3.300202
H  2.86705 1.831183 -2.62659
H  2.078935 -1.815668 -1.808653
H  0.5596 -0.012397 1.777341
H  -0.362676 2.578394 1.801992
H  0.834797 2.142041 0.572878
H  -0.784888 -3.345906 1.405591
H  -2.512397 -3.682102 1.300257
H  3.236945 -3.500317 -0.460855
H  1.717765 -1.687661 3.107016
H  3.069185 -3.452966 2.012866
H  -1.177613 -1.950736 3.455488
H  -1.77931 -3.594706 3.655132
H  -2.911661 -2.280506 3.346902
elementType: Cl O N C H
totalener: -1288.45032266 hartree
nucrepener: 1805.37041069 hartree
electener: -3093.82073335 hartree
oneelecener: -5349.45593026 hartree
twoeener: 2255.63519691 hartree
cpcmener: -0.03188537 hartree
kineticenergy: 1283.96759513 hartree
xcener: -102.810888732174 hartree
chargesum: -0.0000000
charge: -0.161705 -0.363951 -0.506246 -0.021927 -0.021482 -0.030128 0.123803 0.035883 -0.019513 0.285718 -0.300181 -0.264495 -0.276786 -0.209346 -0.091300 0.030823 -0.137339 -0.195844 -0.145551 -0.254184 0.108292 0.102186 0.110857 0.090905 0.115630 0.092202 0.099066 0.106533 0.110182 0.103615 0.152566 0.140896 0.158089 0.144916 0.072034 0.092817 0.155697 0.154726 0.157417 0.077684 0.087347 0.090092
qa: -0.1617 -0.3640 -0.5062 -0.0219 -0.0215 -0.0301 0.1238 0.0359 -0.0195 0.2857 -0.3002 -0.2645 -0.2768 -0.2093 -0.0913 0.0308 -0.1373 -0.1958 -0.1456 -0.2542 0.1083 0.1022 0.1109 0.0909 0.1156 0.0922 0.0991 0.1065 0.1102 0.1036 0.1526 0.1409 0.1581 0.1449 0.0720 0.0928 0.1557 0.1547 0.1574 0.0777 0.0873 0.0901
va: 1.1110 1.9357 2.0128 3.0118 3.6671 3.8115 3.6237 3.3961 3.9659 4.1687 3.9578 3.9163 3.9617 3.8980 3.9626 3.8696 3.9010 3.9270 3.8941 3.9511 1.0048 1.0349 1.0007 0.9854 0.9978 1.0102 1.0083 1.0013 0.9955 1.0001 0.9969 1.0135 1.0046 1.0075 0.9870 0.9943 0.9921 0.9956 0.9901 1.0032 1.0080 1.0056
dispcorr: -0.025133064 hartree
energy: -1288.475455728213
dipole: 3.91153 -1.73686 2.17467 -21.89555 19.77915 -2.11641 -1.89882 0.82478 -1.07404
magnitude: 3.21899 au
magnitude: 8.18203 debye
