program: Orca
programVersion: 5.0.2
elementType: Cl O O N C C C C C C C C C C C C C C C C H H H H H H H H H H H H H H H H H H H H H H
charge: 0
multiplicity: 1
keywords: wb97x-d3
keywords: def2-TZVPP
keywords: def2/J RIJCOSX
keywords: DEFGRID2
keywords: scfconv7
keywords: smallprint printgap noloewdin
keywords: NOSOSCF
formula: C16H22ClNO2
InChI: InChI=1/C16H22ClNO2/c1-4-20-11-10-18(15(19)12-17)16(13(2)3)14-8-6-5-7-9-14/h5-9H,4,10-12H2,1-3H3
42 atoms
Cl -0.05743 3.472633 1.674925
O  -1.343413 -2.182047 0.517063
O  -2.29188 2.025505 0.313589
N  -0.877209 0.597713 -0.707759
C  0.405208 0.286703 -1.256601
C  -1.959652 -0.366442 -0.910498
C  0.78827 0.811882 -2.429773
C  1.209828 -0.662869 -0.452607
C  -2.326146 -1.200855 0.300549
C  -1.174464 1.768889 -0.103898
C  -0.085092 1.716472 -3.242384
C  2.143888 0.586579 -3.025948
C  1.700049 -1.840508 -1.01347
C  1.444897 -0.422958 0.901596
C  -0.061775 2.795561 0.020476
C  -1.628686 -3.073412 1.572821
C  2.419129 -2.747685 -0.247845
C  2.172391 -1.322043 1.665358
C  2.660121 -2.490586 1.094195
C  -1.496349 -2.465086 2.956585
H  -1.670383 -1.020495 -1.733629
H  -2.850436 0.1724 -1.236738
H  -2.460732 -0.554578 1.174712
H  -3.300292 -1.670125 0.100033
H  -1.129197 1.72093 -2.936497
H  0.283681 2.744991 -3.199443
H  -0.046301 1.423807 -4.294219
H  2.077627 -0.058789 -3.905258
H  2.556452 1.537132 -3.372544
H  2.858592 0.142726 -2.336875
H  1.499337 -2.061424 -2.054635
H  1.057781 0.47093 1.375826
H  0.934134 2.413217 -0.177909
H  -0.261156 3.61545 -0.670512
H  -0.916899 -3.89555 1.468024
H  -2.63278 -3.503381 1.450558
H  2.783399 -3.661443 -0.699957
H  2.352559 -1.113136 2.712305
H  3.21855 -3.198155 1.693665
H  -1.653874 -3.239872 3.708743
H  -2.229098 -1.679223 3.143921
H  -0.500041 -2.048163 3.113219
elementType: Cl O N C H
totalener: -1288.44857166 hartree
nucrepener: 1799.62712895 hartree
electener: -3088.07570061 hartree
oneelecener: -5338.34292023 hartree
twoeener: 2250.26721963 hartree
cpcmener: -0.03022926 hartree
kineticenergy: 1283.97018088 hartree
xcener: -102.808957664040 hartree
chargesum: 0.0000000
charge: -0.165137 -0.353374 -0.508424 -0.036034 0.026354 -0.045414 0.101777 0.036763 -0.001463 0.308645 -0.305144 -0.257227 -0.274888 -0.222200 -0.086862 0.017503 -0.153323 -0.189308 -0.138136 -0.259087 0.105991 0.105965 0.087920 0.092944 0.099648 0.108894 0.112293 0.109716 0.104170 0.102672 0.147009 0.126245 0.146753 0.156123 0.090168 0.076464 0.153909 0.155686 0.156428 0.095272 0.086494 0.084216
qa: -0.1651 -0.3534 -0.5084 -0.0360 0.0264 -0.0454 0.1018 0.0368 -0.0015 0.3086 -0.3051 -0.2572 -0.2749 -0.2222 -0.0869 0.0175 -0.1533 -0.1893 -0.1381 -0.2591 0.1060 0.1060 0.0879 0.0929 0.0996 0.1089 0.1123 0.1097 0.1042 0.1027 0.1470 0.1262 0.1468 0.1561 0.0902 0.0765 0.1539 0.1557 0.1564 0.0953 0.0865 0.0842
va: 1.1078 1.9345 2.0104 3.0358 3.5669 3.8490 3.6527 3.3718 3.9177 4.1326 3.9708 3.9074 3.9939 3.9033 3.9751 3.9004 3.9077 3.9174 3.8753 3.8950 1.0139 1.0229 0.9959 0.9992 1.0069 0.9942 0.9985 0.9954 0.9992 1.0040 1.0005 1.0279 1.0055 1.0034 0.9921 1.0013 0.9932 0.9941 0.9902 1.0117 1.0015 1.0028
dispcorr: -0.024659117 hartree
energy: -1288.473230776003
dipole: -0.14566 1.19363 1.04797 -18.06173 16.83238 -1.22935 -8.89123 7.14773 -1.74350
magnitude: 2.37684 au
magnitude: 6.04144 debye
