program: Orca
programVersion: 5.0.2
elementType: Cl O O N C C C C C C C C C C C C C C C C H H H H H H H H H H H H H H H H H H H H H H
charge: 0
multiplicity: 1
keywords: wb97x-d3
keywords: def2-TZVPP
keywords: def2/J RIJCOSX
keywords: DEFGRID2
keywords: scfconv7
keywords: smallprint printgap noloewdin
keywords: NOSOSCF
formula: C16H22ClNO2
InChI: InChI=1/C16H22ClNO2/c1-4-20-11-10-18(15(19)12-17)16(13(2)3)14-8-6-5-7-9-14/h5-9H,4,10-12H2,1-3H3
42 atoms
Cl 0.625405 4.051146 1.227008
O  -2.341102 -1.808856 -0.101997
O  -1.424147 2.053773 1.919351
N  -0.513282 0.421225 0.653936
C  0.202447 0.007647 -0.505601
C  -1.057261 -0.620038 1.51831
C  -0.263931 0.253843 -1.739865
C  1.465707 -0.703341 -0.202476
C  -2.431661 -1.107098 1.111496
C  -0.714018 1.717588 0.987575
C  -1.594437 0.884073 -2.010492
C  0.513607 -0.049015 -2.984311
C  2.369731 -0.162372 0.713798
C  1.754856 -1.942058 -0.773294
C  0.003205 2.765142 0.150477
C  -3.591468 -2.229487 -0.599949
C  3.546623 -0.82738 1.02235
C  2.930821 -2.609674 -0.461928
C  3.832284 -2.053094 0.434609
C  -3.385332 -2.94418 -1.914636
H  -1.106065 -0.249149 2.54083
H  -0.357391 -1.458171 1.521845
H  -2.815763 -1.755841 1.912227
H  -3.125736 -0.259417 1.030206
H  -2.237903 0.976616 -1.138614
H  -1.467871 1.880703 -2.441893
H  -2.132036 0.297537 -2.760006
H  0.076005 -0.895517 -3.519675
H  0.464385 0.803676 -3.665924
H  1.56302 -0.27121 -2.805072
H  2.15749 0.789674 1.186707
H  1.045338 -2.395999 -1.454031
H  0.844747 2.383097 -0.418061
H  -0.700571 3.231024 -0.539053
H  -4.258538 -1.367685 -0.739407
H  -4.086573 -2.897863 0.118449
H  4.242078 -0.388033 1.726156
H  3.13572 -3.572997 -0.911441
H  4.748186 -2.574697 0.681394
H  -2.924452 -2.290112 -2.657017
H  -4.34634 -3.271702 -2.311972
H  -2.755301 -3.827016 -1.79688
elementType: Cl O N C H
totalener: -1288.45323765 hartree
nucrepener: 1774.17101359 hartree
electener: -3062.62425124 hartree
oneelecener: -5286.82654413 hartree
twoeener: 2224.20229289 hartree
cpcmener: -0.02941531 hartree
kineticenergy: 1283.97141771 hartree
xcener: -102.809282056280 hartree
chargesum: -0.0000000
charge: -0.166604 -0.356639 -0.501652 -0.019877 0.086736 -0.039339 0.074341 -0.056298 -0.015469 0.298889 -0.335611 -0.265003 -0.177473 -0.265807 -0.093231 0.031097 -0.170652 -0.155871 -0.145072 -0.255241 0.102228 0.107374 0.099415 0.089535 0.106415 0.119027 0.112147 0.108223 0.104696 0.103440 0.136375 0.149664 0.150635 0.156015 0.078544 0.083728 0.155197 0.155485 0.157816 0.078199 0.089616 0.085003
qa: -0.1666 -0.3566 -0.5017 -0.0199 0.0867 -0.0393 0.0743 -0.0563 -0.0155 0.2989 -0.3356 -0.2650 -0.1775 -0.2658 -0.0932 0.0311 -0.1707 -0.1559 -0.1451 -0.2552 0.1022 0.1074 0.0994 0.0895 0.1064 0.1190 0.1121 0.1082 0.1047 0.1034 0.1364 0.1497 0.1506 0.1560 0.0785 0.0837 0.1552 0.1555 0.1578 0.0782 0.0896 0.0850
va: 1.1061 1.9328 2.0134 3.0036 3.5040 3.8482 3.6262 3.4082 3.9275 4.1224 3.9938 3.9205 3.9162 3.9802 3.9813 3.8779 3.9443 3.9182 3.8900 3.9568 1.0289 1.0080 1.0012 0.9985 1.0010 0.9973 0.9960 0.9954 0.9986 1.0029 1.0159 1.0012 1.0056 1.0064 0.9887 0.9916 0.9944 0.9934 0.9903 1.0024 1.0094 1.0043
dispcorr: -0.023693244 hartree
energy: -1288.476930893888
dipole: -12.99624 12.89372 -0.10252 -22.83652 21.05001 -1.78651 -17.17575 15.17770 -1.99805
magnitude: 2.68223 au
magnitude: 6.81768 debye
