program: Orca
programVersion: 5.0.2
elementType: Cl O O N C C C C C C C C C C C C C C C C H H H H H H H H H H H H H H H H H H H H H H
charge: 0
multiplicity: 1
keywords: wb97x-d3
keywords: def2-TZVPP
keywords: def2/J RIJCOSX
keywords: DEFGRID2
keywords: scfconv7
keywords: smallprint printgap noloewdin
keywords: NOSOSCF
formula: C16H22ClNO2
InChI: InChI=1/C16H22ClNO2/c1-4-20-11-10-18(15(19)12-17)16(13(2)3)14-8-6-5-7-9-14/h5-9H,4,10-12H2,1-3H3
42 atoms
Cl 1.173843 3.489921 1.18613
O  -2.822747 -1.245662 -0.475139
O  -1.712057 2.214946 1.519768
N  -0.653955 0.539032 0.441509
C  0.168312 0.054186 -0.610314
C  -1.312117 -0.445752 1.29024
C  -0.119605 0.296194 -1.899532
C  1.334743 -0.734376 -0.14895
C  -2.729209 -0.786516 0.846898
C  -0.892796 1.855665 0.703671
C  -1.36258 1.003646 -2.345985
C  0.807109 -0.05585 -3.026095
C  2.148639 -0.251447 0.87617
C  1.619448 -1.987355 -0.689239
C  -0.027566 2.893059 0.003504
C  -2.340606 -2.544791 -0.715348
C  3.23624 -0.986102 1.319048
C  2.706187 -2.724583 -0.244286
C  3.521351 -2.223617 0.759017
C  -3.289283 -3.636636 -0.249227
H  -1.357622 -0.068592 2.312542
H  -0.679892 -1.335005 1.313866
H  -3.142876 -1.506898 1.567173
H  -3.34872 0.108785 0.907989
H  -1.804418 0.471076 -3.190749
H  -2.125684 1.079009 -1.577969
H  -1.131491 2.009819 -2.70879
H  1.802846 -0.344699 -2.700076
H  0.397987 -0.870207 -3.629354
H  0.909659 0.79942 -3.698577
H  1.939394 0.71388 1.320086
H  0.974651 -2.39307 -1.458817
H  0.523852 2.532349 -0.857139
H  -0.652467 3.735091 -0.28454
H  -1.348031 -2.7003 -0.271798
H  -2.20575 -2.616316 -1.797005
H  3.864106 -0.589281 2.105916
H  2.91099 -3.694716 -0.677797
H  4.36944 -2.796972 1.10933
H  -4.2703 -3.526332 -0.710769
H  -3.42343 -3.636051 0.833046
H  -2.894584 -4.615806 -0.523563
totalener: -1288.42326701 hartree
nucrepener: 1798.83183352 hartree
electener: -3087.25510053 hartree
oneelecener: -5335.60888354 hartree
twoeener: 2248.35378301 hartree
kineticenergy: 1284.02652767 hartree
xcener: -102.818314953530 hartree
chargesum: -0.0000000
charge: -0.126222 -0.333503 -0.381630 -0.006809 0.078917 -0.090206 -0.006073 0.009066 -0.010949 0.252613 -0.283415 -0.251453 -0.181676 -0.292531 -0.111091 0.051919 -0.134422 -0.114315 -0.121489 -0.243062 0.109149 0.108921 0.081803 0.109181 0.098820 0.113827 0.096675 0.108132 0.096294 0.094827 0.119006 0.131856 0.133494 0.142929 0.049847 0.078971 0.128624 0.125706 0.127496 0.090451 0.071248 0.079075
qa: -0.1262 -0.3335 -0.3816 -0.0068 0.0789 -0.0902 -0.0061 0.0091 -0.0109 0.2526 -0.2834 -0.2515 -0.1817 -0.2925 -0.1111 0.0519 -0.1344 -0.1143 -0.1215 -0.2431 0.1091 0.1089 0.0818 0.1092 0.0988 0.1138 0.0967 0.1081 0.0963 0.0948 0.1190 0.1319 0.1335 0.1429 0.0498 0.0790 0.1286 0.1257 0.1275 0.0905 0.0712 0.0791
va: 1.1490 1.9521 2.1309 2.9521 3.5105 3.8339 3.6455 3.3277 3.8832 4.1427 3.9956 3.9189 3.9858 4.0123 3.9785 3.9236 4.0077 3.9866 3.9626 3.9488 1.0307 0.9892 0.9980 1.0136 1.0031 1.0137 0.9963 1.0050 0.9973 1.0018 1.0575 1.0025 1.0096 1.0045 0.9870 0.9885 1.0019 1.0019 0.9997 1.0074 1.0053 1.0120
dispcorr: -0.025056710 hartree
energy: -1288.448323719810
dipole: -11.07516 11.54166 0.46650 -22.98223 21.53740 -1.44483 -13.58239 12.50138 -1.08101
magnitude: 1.86380 au
magnitude: 4.73739 debye
