program: Orca
programVersion: 5.0.2
elementType: Cl O O N C C C C C C C C C C C C C C C C H H H H H H H H H H H H H H H H H H H H H H
charge: 0
multiplicity: 1
keywords: wb97x-d3
keywords: def2-TZVPP
keywords: def2/J RIJCOSX
keywords: DEFGRID2
keywords: scfconv7
keywords: smallprint printgap noloewdin
keywords: NOSOSCF
formula: C16H22ClNO2
InChI: InChI=1/C16H22ClNO2/c1-4-20-11-10-18(15(19)12-17)16(13(2)3)14-8-6-5-7-9-14/h5-9H,4,10-12H2,1-3H3
42 atoms
Cl 0.625175 3.957219 -0.153447
O  -1.745273 -2.09514 0.448329
O  -1.668851 2.216897 1.490169
N  -0.863329 0.786422 -0.063589
C  0.234846 0.30161 -0.835352
C  -2.168506 0.153231 -0.198086
C  0.5020 0.869834 -2.024255
C  0.992294 -0.818574 -0.231702
C  -2.447738 -0.942491 0.811169
C  -0.747686 1.82783 0.805157
C  -0.405839 1.874457 -2.665414
C  1.726033 0.573718 -2.839259
C  1.488186 -1.863972 -1.011082
C  1.199189 -0.885945 1.147185
C  0.609171 2.514109 0.899428
C  -1.793807 -3.108202 1.417297
C  2.216235 -2.89917 -0.447433
C  1.925424 -1.919246 1.71537
C  2.449926 -2.926552 0.918974
C  -1.130516 -4.350216 0.867845
H  -2.243038 -0.25534 -1.206996
H  -2.932757 0.924163 -0.098567
H  -2.174961 -0.594988 1.81761
H  -3.532118 -1.134135 0.828659
H  0.1253 2.804459 -2.869752
H  -0.741514 1.486253 -3.631196
H  -1.28538 2.118038 -2.076828
H  1.493792 -0.054038 -3.703384
H  2.124848 1.508518 -3.238149
H  2.516987 0.087986 -2.273466
H  1.274556 -1.887893 -2.070613
H  0.781212 -0.132269 1.802074
H  0.74011 2.860232 1.922016
H  1.454037 1.894089 0.613224
H  -2.835785 -3.33052 1.694863
H  -1.285192 -2.784289 2.337434
H  2.586436 -3.697054 -1.077995
H  2.078825 -1.938382 2.786559
H  3.017354 -3.734475 1.361583
H  -1.649783 -4.713014 -0.01935
H  -1.144021 -5.144429 1.614608
H  -0.093181 -4.150664 0.602331
totalener: -1288.42372790 hartree
nucrepener: 1813.97630067 hartree
electener: -3102.40002857 hartree
oneelecener: -5366.13654479 hartree
twoeener: 2263.73651623 hartree
kineticenergy: 1284.03347820 hartree
xcener: -102.817957404811 hartree
chargesum: 0.0000000
charge: -0.130954 -0.305212 -0.385405 -0.055803 -0.030431 -0.045737 0.083877 0.110167 -0.015414 0.234626 -0.285980 -0.264310 -0.236064 -0.231177 -0.090840 0.022266 -0.133139 -0.146004 -0.125380 -0.238356 0.099164 0.106020 0.086996 0.077664 0.095367 0.105311 0.096681 0.097378 0.095974 0.109830 0.130180 0.133270 0.147369 0.130573 0.075293 0.066151 0.124377 0.124289 0.126597 0.082273 0.076652 0.081858
qa: -0.1310 -0.3052 -0.3854 -0.0558 -0.0304 -0.0457 0.0839 0.1102 -0.0154 0.2346 -0.2860 -0.2643 -0.2361 -0.2312 -0.0908 0.0223 -0.1331 -0.1460 -0.1254 -0.2384 0.0992 0.1060 0.0870 0.0777 0.0954 0.1053 0.0967 0.0974 0.0960 0.1098 0.1302 0.1333 0.1474 0.1306 0.0753 0.0662 0.1244 0.1243 0.1266 0.0823 0.0767 0.0819
va: 1.1421 1.9737 2.1265 3.0023 3.6894 3.8735 3.6337 3.4083 3.9590 4.1717 3.9648 3.9314 4.0322 3.9531 3.9796 3.9056 3.9253 3.9930 3.9238 3.9527 1.0098 1.0218 0.9961 1.0031 1.0101 0.9989 1.0120 0.9972 1.0047 1.0016 0.9984 1.0088 1.0052 1.0079 0.9933 0.9923 1.0031 1.0041 1.0002 1.0096 1.0118 1.0053
dispcorr: -0.025552969 hartree
energy: -1288.449280866605
dipole: -3.13635 3.73054 0.59419 -23.54669 22.22985 -1.31684 -4.32933 3.77742 -0.55191
magnitude: 1.54652 au
magnitude: 3.93094 debye
