program: Orca
programVersion: 5.0.2
elementType: Cl O O N C C C C C C C C C C C C C C C C H H H H H H H H H H H H H H H H H H H H H H
charge: 0
multiplicity: 1
keywords: wb97x-d3
keywords: def2-TZVPP
keywords: def2/J RIJCOSX
keywords: DEFGRID2
keywords: scfconv7
keywords: smallprint printgap noloewdin
keywords: NOSOSCF
formula: C16H22ClNO2
InChI: InChI=1/C16H22ClNO2/c1-4-20-11-10-18(15(19)12-17)16(13(2)3)14-8-6-5-7-9-14/h5-9H,4,10-12H2,1-3H3
42 atoms
Cl 0.274186 3.961595 -0.260613
O  -1.893018 -1.75955 0.969323
O  -2.223098 2.088609 0.65219
N  -0.909215 0.586097 -0.429077
C  0.379009 0.229194 -0.9259
C  -2.04265 -0.226786 -0.841861
C  0.844605 0.81408 -2.043474
C  1.101392 -0.801271 -0.142653
C  -1.941779 -1.678979 -0.421931
C  -1.125921 1.709272 0.314189
C  0.015588 1.734522 -2.886307
C  2.24128 0.632975 -2.560263
C  1.058724 -0.798907 1.252154
C  1.800483 -1.833351 -0.77156
C  0.106304 2.496618 0.746054
C  -1.598138 -3.050087 1.436919
C  1.748495 -1.748365 1.987873
C  2.477918 -2.794068 -0.038028
C  2.46464 -2.748905 1.347813
C  -1.620329 -3.046297 2.948279
H  -2.133217 -0.193764 -1.932739
H  -2.943209 0.219924 -0.425378
H  -2.821364 -2.205405 -0.824673
H  -1.062828 -2.153891 -0.880589
H  0.466524 2.726071 -2.933675
H  -0.015302 1.354754 -3.911042
H  -1.006764 1.855564 -2.539805
H  2.638619 1.602688 -2.866729
H  2.923852 0.208681 -1.828354
H  2.260706 -0.001529 -3.449928
H  0.474276 -0.05711 1.778526
H  1.791761 -1.900705 -1.851482
H  -0.054883 2.827601 1.769902
H  1.044719 1.953846 0.684046
H  -0.610798 -3.371742 1.074784
H  -2.330439 -3.777946 1.055521
H  1.715221 -1.713991 3.069091
H  3.008084 -3.585225 -0.551752
H  2.996275 -3.493931 1.924747
H  -2.598808 -2.754194 3.328762
H  -0.87874 -2.355981 3.34919
H  -1.392364 -4.042181 3.328194
totalener: -1288.42330021 hartree
nucrepener: 1816.52439071 hartree
electener: -3104.94769093 hartree
oneelecener: -5371.08816291 hartree
twoeener: 2266.14047198 hartree
kineticenergy: 1284.03836290 hartree
xcener: -102.821831862261 hartree
chargesum: 0.0000000
charge: -0.132349 -0.306446 -0.375047 -0.042874 -0.028624 -0.036631 0.075672 0.079397 -0.020740 0.244662 -0.291800 -0.267579 -0.184755 -0.278213 -0.105727 0.025479 -0.180703 -0.106401 -0.116649 -0.238781 0.083543 0.110677 0.090988 0.078181 0.098463 0.105617 0.095358 0.098493 0.109824 0.096719 0.134666 0.137540 0.147794 0.128874 0.068441 0.080077 0.129462 0.125564 0.127596 0.091601 0.072625 0.076003
qa: -0.1323 -0.3064 -0.3750 -0.0429 -0.0286 -0.0366 0.0757 0.0794 -0.0207 0.2447 -0.2918 -0.2676 -0.1848 -0.2782 -0.1057 0.0255 -0.1807 -0.1064 -0.1166 -0.2388 0.0835 0.1107 0.0910 0.0782 0.0985 0.1056 0.0954 0.0985 0.1098 0.0967 0.1347 0.1375 0.1478 0.1289 0.0684 0.0801 0.1295 0.1256 0.1276 0.0916 0.0726 0.0760
va: 1.1419 1.9835 2.1481 2.9801 3.6753 3.8419 3.6370 3.4643 3.9732 4.1739 3.9647 3.9309 3.9515 4.0091 3.9939 3.8864 3.9730 3.9566 3.9541 3.9563 1.0038 1.0424 1.0008 0.9817 1.0125 0.9978 1.0115 1.0039 1.0016 0.9978 1.0176 0.9986 1.0035 1.0080 0.9847 0.9957 1.0017 1.0015 1.0000 1.0091 1.0081 1.0089
dispcorr: -0.025619292 hartree
energy: -1288.448919504999
dipole: 0.71150 0.44071 1.15221 -23.09775 21.44583 -1.65192 -2.15456 1.47212 -0.68244
magnitude: 2.12654 au
magnitude: 5.40523 debye
