program: Orca
programVersion: 5.0.2
elementType: Cl O O N C C C C C C C C C C C C C C C C H H H H H H H H H H H H H H H H H H H H H H
charge: 0
multiplicity: 1
keywords: wb97x-d3
keywords: def2-TZVPP
keywords: def2/J RIJCOSX
keywords: DEFGRID2
keywords: scfconv7
keywords: smallprint printgap noloewdin
keywords: NOSOSCF
formula: C16H22ClNO2
InChI: InChI=1/C16H22ClNO2/c1-4-20-11-10-18(15(19)12-17)16(13(2)3)14-8-6-5-7-9-14/h5-9H,4,10-12H2,1-3H3
42 atoms
Cl -0.57675 4.111888 -0.310662
O  -1.788167 -2.134987 0.200335
O  -1.318982 2.150964 1.899738
N  -0.309403 0.441209 0.81091
C  0.374054 -0.054937 -0.331243
C  -0.89191 -0.538984 1.718534
C  -0.050715 0.210703 -1.575477
C  1.552196 -0.892945 -0.015159
C  -2.14432 -1.207884 1.189246
C  -0.530482 1.766717 1.068283
C  -1.316381 0.954408 -1.875484
C  0.7253 -0.169168 -2.801389
C  1.680907 -2.175136 -0.543625
C  2.532424 -0.431547 0.861777
C  0.372854 2.765892 0.357332
C  -2.86841 -2.805722 -0.396012
C  2.783305 -2.958863 -0.240167
C  3.634125 -1.213846 1.168001
C  3.76526 -2.479296 0.61358
C  -3.541237 -2.009218 -1.501108
H  -1.13062 -0.03612 2.65306
H  -0.141233 -1.302558 1.93507
H  -2.647234 -1.713563 2.028095
H  -2.83945 -0.441959 0.820173
H  -1.840788 0.463945 -2.69828
H  -2.00338 1.011554 -1.034618
H  -1.11284 1.975664 -2.205656
H  0.207966 -0.953387 -3.360218
H  0.797668 0.689488 -3.473535
H  1.733485 -0.516111 -2.590469
H  0.896226 -2.562546 -1.17987
H  2.435043 0.550774 1.308255
H  1.038799 3.183862 1.113666
H  0.976361 2.344298 -0.439261
H  -3.610838 -3.098952 0.35994
H  -2.463132 -3.731237 -0.811088
H  2.867235 -3.952854 -0.659741
H  4.391142 -0.836414 1.842853
H  4.623535 -3.092401 0.854767
H  -4.342758 -2.595797 -1.95168
H  -2.828442 -1.756146 -2.285959
H  -3.983156 -1.081685 -1.135373
totalener: -1288.42270814 hartree
nucrepener: 1791.78639312 hartree
electener: -3080.20910126 hartree
oneelecener: -5321.69311764 hartree
twoeener: 2241.48401638 hartree
kineticenergy: 1284.03875529 hartree
xcener: -102.818793752877 hartree
chargesum: -0.0000000
charge: -0.122142 -0.300976 -0.373959 -0.048662 0.055883 -0.048863 0.046497 -0.025677 -0.034487 0.247622 -0.325608 -0.255766 -0.222399 -0.152871 -0.112288 0.025525 -0.123401 -0.141360 -0.111570 -0.243383 0.108325 0.105770 0.083854 0.087942 0.097006 0.107051 0.114907 0.093051 0.100679 0.103921 0.122144 0.114797 0.133149 0.135252 0.060999 0.080405 0.124350 0.124829 0.126540 0.094689 0.071366 0.076861
qa: -0.1221 -0.3010 -0.3740 -0.0487 0.0559 -0.0489 0.0465 -0.0257 -0.0345 0.2476 -0.3256 -0.2558 -0.2224 -0.1529 -0.1123 0.0255 -0.1234 -0.1414 -0.1116 -0.2434 0.1083 0.1058 0.0839 0.0879 0.0970 0.1071 0.1149 0.0931 0.1007 0.1039 0.1221 0.1148 0.1331 0.1353 0.0610 0.0804 0.1243 0.1248 0.1265 0.0947 0.0714 0.0769
va: 1.1483 1.9656 2.1403 2.9706 3.5659 3.8724 3.5855 3.4385 3.9420 4.1504 3.9777 3.9238 4.0273 3.9612 4.0183 3.9226 3.9648 4.0031 3.9476 3.9049 1.0322 1.0065 1.0030 0.9889 0.9986 1.0032 1.0188 0.9972 0.9989 1.0056 1.0120 1.0180 1.0033 1.0040 1.0009 0.9928 1.0018 1.0034 0.9998 1.0175 1.0052 1.0044
dispcorr: -0.024839933 hartree
energy: -1288.447548074628
dipole: -7.00547 7.47861 0.47314 -21.86477 20.36930 -1.49547 -9.47481 8.79647 -0.67834
magnitude: 1.70893 au
magnitude: 4.34376 debye
