program: Orca
programVersion: 5.0.2
elementType: Cl S O N C C C C C C C C C C C C H H H H H H H H H H H H H H H H
charge: 0
multiplicity: 1
keywords: wb97x-d3
keywords: def2-TZVPP
keywords: def2/J RIJCOSX
keywords: DEFGRID2
keywords: scfconv7
keywords: smallprint printgap noloewdin
keywords: NOSOSCF
formula: C12H16ClNOS
InChI: InChI=1/C12H16ClNOS/c1-3-14(4-2)12(15)16-9-10-7-5-6-8-11(10)13/h5-8H,3-4,9H2,1-2H3
32 atoms
Cl -3.458169 -0.904907 1.832266
S  0.788405 -1.501731 -0.317597
O  1.263525 0.700112 1.056396
N  2.965336 0.008932 -0.268937
C  3.820708 1.120079 0.139774
C  3.520846 -0.933158 -1.232341
C  1.737132 -0.086552 0.251379
C  4.622903 0.811245 1.389876
C  3.237765 -0.550167 -2.672387
C  -0.769196 -1.199206 0.534962
C  -1.67054 -0.150709 -0.064741
C  -2.943449 0.046577 0.47273
C  -1.313137 0.646243 -1.147334
C  -3.828611 0.98047 -0.040668
C  -2.185018 1.587726 -1.675046
C  -3.444895 1.756423 -1.123421
H  4.489215 1.334617 -0.694321
H  3.213276 2.012349 0.282394
H  4.596551 -0.970284 -1.05808
H  3.164269 -1.942522 -1.021057
H  3.972614 0.623216 2.244291
H  5.258724 -0.06325 1.245927
H  5.26736 1.654795 1.63818
H  3.639359 0.437294 -2.902519
H  3.705874 -1.266633 -3.347384
H  2.167772 -0.540901 -2.881571
H  -0.563618 -0.984001 1.583857
H  -1.268667 -2.170594 0.517917
H  -0.340614 0.520453 -1.605324
H  -4.809094 1.100172 0.400133
H  -1.873753 2.189248 -2.518425
H  -4.132275 2.486498 -1.52912
elementType: Cl S O N C H
totalener: -1455.38943880 hartree
nucrepener: 1333.86953760 hartree
electener: -2789.25897641 hartree
oneelecener: -4647.07404415 hartree
twoeener: 1857.81506775 hartree
cpcmener: -0.02592241 hartree
kineticenergy: 1451.33421212 hartree
xcener: -99.508121578225 hartree
chargesum: 0.0000000
charge: -0.095234 -0.129931 -0.548693 -0.110026 -0.025804 -0.045516 0.315764 -0.249089 -0.243716 -0.013732 -0.056776 0.029474 -0.137590 -0.143738 -0.162164 -0.163107 0.098775 0.086469 0.105628 0.095339 0.082557 0.083748 0.096147 0.088282 0.098192 0.076017 0.119812 0.141588 0.143461 0.141963 0.160348 0.161554
qa: -0.0952 -0.1299 -0.5487 -0.1100 -0.0258 -0.0455 0.3158 -0.2491 -0.2437 -0.0137 -0.0568 0.0295 -0.1376 -0.1437 -0.1622 -0.1631 0.0988 0.0865 0.1056 0.0953 0.0826 0.0837 0.0961 0.0883 0.0982 0.0760 0.1198 0.1416 0.1435 0.1420 0.1603 0.1616
va: 1.2364 2.3439 1.9449 3.1975 3.8638 3.8919 4.2369 3.9207 3.9274 3.8844 3.6582 3.9185 3.8504 3.9591 3.9470 3.9143 0.9969 1.0164 0.9950 1.0038 1.0093 1.0044 1.0064 1.0035 1.0083 1.0080 1.0306 1.0050 1.0035 1.0067 0.9900 0.9880
dispcorr: -0.014279204 hartree
energy: -1455.403718006881
dipole: 29.47431 -27.93857 1.53574 6.26629 -6.38547 -0.11917 -11.27945 9.61759 -1.66186
magnitude: 2.26594 au
magnitude: 5.75957 debye
