program: Orca
programVersion: 5.0.2
elementType: Cl S O N C C C C C C C C C C C C H H H H H H H H H H H H H H H H
charge: 0
multiplicity: 1
keywords: wb97x-d3
keywords: def2-TZVPP
keywords: def2/J RIJCOSX
keywords: DEFGRID2
keywords: scfconv7
keywords: smallprint printgap noloewdin
keywords: NOSOSCF
formula: C12H16ClNOS
InChI: InChI=1/C12H16ClNOS/c1-3-14(4-2)12(15)16-9-10-7-5-6-8-11(10)13/h5-8H,3-4,9H2,1-2H3
32 atoms
Cl -2.825739 -1.126388 -1.695629
S  0.774132 -1.204614 1.258512
O  0.696134 -0.2842 -1.209178
N  2.668022 0.021162 -0.136876
C  3.263237 0.708054 -1.278944
C  3.507512 -0.145757 1.041692
C  1.403116 -0.408109 -0.222648
C  3.955544 -0.238557 -2.241921
C  3.404738 1.010973 2.018461
C  -0.955491 -1.424333 0.767114
C  -1.712513 -0.137953 0.590493
C  -2.566807 0.092855 -0.485003
C  -1.601955 0.87572 1.541894
C  -3.256849 1.288939 -0.630244
C  -2.289037 2.070856 1.418385
C  -3.112076 2.283686 0.321408
H  2.497098 1.285705 -1.793219
H  3.976624 1.431932 -0.884025
H  3.280817 -1.092749 1.534813
H  4.534501 -0.250814 0.690491
H  4.405421 0.325031 -3.059601
H  4.750127 -0.798414 -1.746831
H  3.252492 -0.951822 -2.672423
H  4.080099 0.849815 2.858784
H  3.682071 1.952598 1.543051
H  2.393879 1.113215 2.413388
H  -1.385375 -2.001317 1.588798
H  -0.998248 -2.059546 -0.113247
H  -0.950362 0.723369 2.393322
H  -3.902773 1.440341 -1.484471
H  -2.177571 2.835832 2.175111
H  -3.646818 3.216788 0.205639
elementType: Cl S O N C H
totalener: -1455.38776220 hartree
nucrepener: 1357.07278382 hartree
electener: -2812.46054603 hartree
oneelecener: -4694.04448849 hartree
twoeener: 1881.58394246 hartree
cpcmener: -0.02688981 hartree
kineticenergy: 1451.33712240 hartree
xcener: -99.507767483001 hartree
chargesum: 0.0000000
charge: -0.097566 -0.124644 -0.543023 -0.113306 -0.022467 -0.046710 0.324135 -0.250215 -0.240181 -0.063699 0.044390 0.014705 -0.188619 -0.132635 -0.145384 -0.179323 0.085268 0.098239 0.094187 0.104995 0.095774 0.083448 0.082175 0.095329 0.087370 0.075075 0.149537 0.112899 0.136917 0.140287 0.161473 0.161574
qa: -0.0976 -0.1246 -0.5430 -0.1133 -0.0225 -0.0467 0.3241 -0.2502 -0.2402 -0.0637 0.0444 0.0147 -0.1886 -0.1326 -0.1454 -0.1793 0.0853 0.0982 0.0942 0.1050 0.0958 0.0834 0.0822 0.0953 0.0874 0.0751 0.1495 0.1129 0.1369 0.1403 0.1615 0.1616
va: 1.2285 2.3191 1.9619 3.1827 3.8612 3.8982 4.2396 3.9235 3.9227 3.8528 3.5403 3.8920 3.9210 3.9501 3.9140 3.9273 1.0182 0.9969 1.0041 0.9949 1.0064 1.0045 1.0088 1.0083 1.0039 1.0110 1.0011 1.0472 1.0119 1.0065 0.9887 0.9883
dispcorr: -0.014594808 hartree
energy: -1455.402357010731
dipole: 26.24345 -24.67802 1.56544 9.22246 -8.40159 0.82087 5.81603 -4.31758 1.49844
magnitude: 2.31727 au
magnitude: 5.89003 debye
