program: Orca
programVersion: 5.0.2
elementType: Cl S O N C C C C C C C C C C C C H H H H H H H H H H H H H H H H
charge: 0
multiplicity: 1
keywords: wb97x-d3
keywords: def2-TZVPP
keywords: def2/J RIJCOSX
keywords: DEFGRID2
keywords: scfconv7
keywords: smallprint printgap noloewdin
keywords: NOSOSCF
formula: C12H16ClNOS
InChI: InChI=1/C12H16ClNOS/c1-3-14(4-2)12(15)16-9-10-7-5-6-8-11(10)13/h5-8H,3-4,9H2,1-2H3
32 atoms
Cl -1.113006 -1.58294 -0.137849
S  0.693217 1.343825 0.217992
O  1.570549 -0.520787 1.875663
N  2.89038 -0.133057 0.078962
C  3.840879 -1.151591 0.523484
C  3.038782 0.409166 -1.26829
C  1.794869 0.065064 0.829436
C  3.448627 -2.575434 0.171091
C  2.27529 -0.347054 -2.341466
C  -0.755398 1.113708 1.296085
C  -1.994249 0.905589 0.48348
C  -2.253473 -0.278318 -0.205345
C  -2.942349 1.921355 0.391916
C  -3.408522 -0.453422 -0.949732
C  -4.103658 1.765086 -0.349259
C  -4.336401 0.575231 -1.021516
H  4.802044 -0.906707 0.072798
H  3.974893 -1.056051 1.599916
H  2.755461 1.463206 -1.271783
H  4.104257 0.40059 -1.49471
H  2.469724 -2.836208 0.571538
H  3.432069 -2.737716 -0.905285
H  4.175848 -3.267626 0.597012
H  2.400774 0.157479 -3.299875
H  2.641497 -1.366437 -2.454773
H  1.208408 -0.389191 -2.123617
H  -0.860692 2.001698 1.916686
H  -0.549186 0.273202 1.957979
H  -2.759313 2.851025 0.916497
H  -3.585091 -1.385382 -1.469453
H  -4.822667 2.571543 -0.401144
H  -5.238794 0.43902 -1.602111
elementType: Cl S O N C H
totalener: -1455.38770061 hartree
nucrepener: 1374.82125544 hartree
electener: -2830.20895605 hartree
oneelecener: -4729.25657560 hartree
twoeener: 1899.04761954 hartree
cpcmener: -0.02488712 hartree
kineticenergy: 1451.35073696 hartree
xcener: -99.510145371095 hartree
chargesum: -0.0000000
charge: -0.094573 -0.111122 -0.533404 -0.124937 -0.012864 -0.036759 0.307173 -0.267035 -0.252041 -0.107989 0.040844 0.007027 -0.155534 -0.139305 -0.142672 -0.172569 0.093667 0.088685 0.098118 0.096941 0.081369 0.091000 0.100262 0.100005 0.094880 0.067089 0.128046 0.140600 0.146589 0.143875 0.162428 0.162207
qa: -0.0946 -0.1111 -0.5334 -0.1249 -0.0129 -0.0368 0.3072 -0.2670 -0.2520 -0.1080 0.0408 0.0070 -0.1555 -0.1393 -0.1427 -0.1726 0.0937 0.0887 0.0981 0.0969 0.0814 0.0910 0.1003 0.1000 0.0949 0.0671 0.1280 0.1406 0.1466 0.1439 0.1624 0.1622
va: 1.2422 2.3244 1.9606 3.1967 3.8534 3.8979 4.2697 3.9079 3.9039 3.8241 3.5688 3.9068 3.9122 3.9533 3.8921 3.9224 1.0046 1.0131 0.9981 1.0011 1.0120 0.9995 1.0081 1.0109 0.9998 1.0226 1.0128 1.0361 1.0008 1.0051 0.9884 0.9882
dispcorr: -0.015140098 hartree
energy: -1455.402840706964
dipole: 14.90223 -14.76234 0.13988 -1.28340 2.01025 0.72685 -6.53889 5.09782 -1.44107
magnitude: 1.62005 au
magnitude: 4.11784 debye
