program: Orca
programVersion: 5.0.2
elementType: Cl S O N C C C C C C C C C C C C H H H H H H H H H H H H H H H H
charge: 0
multiplicity: 1
keywords: wb97x-d3
keywords: def2-TZVPP
keywords: def2/J RIJCOSX
keywords: DEFGRID2
keywords: scfconv7
keywords: smallprint printgap noloewdin
keywords: NOSOSCF
formula: C12H16ClNOS
InChI: InChI=1/C12H16ClNOS/c1-3-14(4-2)12(15)16-9-10-7-5-6-8-11(10)13/h5-8H,3-4,9H2,1-2H3
32 atoms
Cl -2.639161 -1.970314 0.16136
S  0.572736 -0.997528 -0.490818
O  1.48488 1.470426 -0.711685
N  2.728061 0.105279 0.596848
C  3.761493 1.130779 0.744304
C  2.994983 -1.222124 1.137893
C  1.685658 0.377892 -0.2040
C  4.687624 1.267414 -0.452103
C  3.776932 -2.138709 0.213121
C  -0.754289 -0.161336 -1.409868
C  -1.750947 0.498687 -0.511025
C  -2.653747 -0.23813 0.254154
C  -1.805384 1.886432 -0.407483
C  -3.574693 0.369773 1.09156
C  -2.718542 2.512807 0.427281
C  -3.602376 1.753685 1.179249
H  3.284472 2.08633 0.961775
H  4.338692 0.867622 1.629662
H  3.543094 -1.080703 2.069028
H  2.051487 -1.687636 1.427149
H  5.234084 0.345087 -0.645794
H  4.147895 1.540989 -1.357887
H  5.420184 2.050858 -0.255263
H  3.2794 -2.263815 -0.748806
H  4.783594 -1.763938 0.031126
H  3.86893 -3.12406 0.67078
H  -1.212617 -0.947818 -2.010005
H  -0.313936 0.552542 -2.102682
H  -1.122515 2.482588 -0.998227
H  -4.264909 -0.22952 1.66978
H  -2.738439 3.592532 0.48862
H  -4.318577 2.231705 1.833969
elementType: Cl S O N C H
totalener: -1455.38933490 hartree
nucrepener: 1349.54261921 hartree
electener: -2804.93195411 hartree
oneelecener: -4678.69180079 hartree
twoeener: 1873.75984669 hartree
cpcmener: -0.02307821 hartree
kineticenergy: 1451.34612237 hartree
xcener: -99.509159771362 hartree
chargesum: -0.0000000
charge: -0.091788 -0.114880 -0.551814 -0.131525 -0.018441 -0.037695 0.333301 -0.264175 -0.261734 -0.091362 0.026375 -0.001243 -0.150001 -0.140194 -0.153043 -0.167375 0.092062 0.093390 0.098860 0.097138 0.088256 0.084709 0.099312 0.079101 0.096216 0.100193 0.153617 0.122909 0.143206 0.142311 0.161758 0.162557
qa: -0.0918 -0.1149 -0.5518 -0.1315 -0.0184 -0.0377 0.3333 -0.2642 -0.2617 -0.0914 0.0264 -0.0012 -0.1500 -0.1402 -0.1530 -0.1674 0.0921 0.0934 0.0989 0.0971 0.0883 0.0847 0.0993 0.0791 0.0962 0.1002 0.1536 0.1229 0.1432 0.1423 0.1618 0.1626
va: 1.2385 2.3294 1.9395 3.2049 3.8552 3.8675 4.2424 3.9077 3.9025 3.8044 3.5180 3.9418 3.8880 3.9598 3.9167 3.9227 1.0109 1.0039 1.0018 1.0123 1.0010 1.0130 1.0063 1.0161 0.9991 1.0090 1.0047 1.0380 1.0144 1.0055 0.9893 0.9875
dispcorr: -0.014281443 hartree
energy: -1455.403616338673
dipole: 27.22119 -26.35006 0.87113 7.04138 -7.24284 -0.20147 1.52467 -0.68736 0.83731
magnitude: 1.22497 au
magnitude: 3.11363 debye
