program: Orca
programVersion: 5.0.2
elementType: Cl S O N C C C C C C C C C C C C H H H H H H H H H H H H H H H H
charge: 0
multiplicity: 1
keywords: wb97x-d3
keywords: def2-TZVPP
keywords: def2/J RIJCOSX
keywords: DEFGRID2
keywords: scfconv7
keywords: smallprint printgap noloewdin
keywords: NOSOSCF
formula: C12H16ClNOS
InChI: InChI=1/C12H16ClNOS/c1-3-14(4-2)12(15)16-9-10-7-5-6-8-11(10)13/h5-8H,3-4,9H2,1-2H3
32 atoms
Cl -2.235743 -1.699683 0.927911
S  0.502229 0.16933 -0.414071
O  2.012206 0.630211 1.690845
N  3.083392 -0.325294 -0.061638
C  4.368535 -0.313281 0.631147
C  3.069054 -0.874756 -1.409788
C  2.007175 0.179408 0.554567
C  4.605249 -1.563494 1.45722
C  3.373377 0.157508 -2.479958
C  -0.643138 0.919898 0.787336
C  -2.012977 0.898033 0.183605
C  -2.817437 -0.240045 0.195374
C  -2.522304 2.040716 -0.42883
C  -4.087687 -0.241921 -0.359603
C  -3.78832 2.056153 -0.992443
C  -4.572701 0.912509 -0.954653
H  5.143307 -0.213993 -0.129864
H  4.436639 0.577073 1.254154
H  3.809752 -1.674901 -1.438347
H  2.112665 -1.36337 -1.603279
H  4.568578 -2.460779 0.838216
H  5.589784 -1.520712 1.923606
H  3.862945 -1.664336 2.249223
H  3.387234 -0.316345 -3.461383
H  2.623213 0.948223 -2.498034
H  4.349171 0.616979 -2.317942
H  -0.338252 1.94622 0.982228
H  -0.605301 0.362146 1.72131
H  -1.909889 2.933535 -0.453965
H  -4.693893 -1.13694 -0.328004
H  -4.161424 2.958916 -1.456887
H  -5.564388 0.912514 -1.386651
elementType: Cl S O N C H
totalener: -1455.38979373 hartree
nucrepener: 1324.03252481 hartree
electener: -2779.42231854 hartree
oneelecener: -4627.39518014 hartree
twoeener: 1847.97286160 hartree
cpcmener: -0.02564180 hartree
kineticenergy: 1451.34122535 hartree
xcener: -99.506954660235 hartree
chargesum: -0.0000000
charge: -0.088161 -0.109482 -0.554981 -0.117670 -0.022332 -0.045874 0.337604 -0.249061 -0.242434 -0.075778 -0.007492 0.021265 -0.149190 -0.142180 -0.153814 -0.157008 0.098114 0.085218 0.104803 0.093230 0.083008 0.095192 0.082021 0.095368 0.075294 0.087808 0.125108 0.115709 0.148082 0.142388 0.162254 0.162991
qa: -0.0882 -0.1095 -0.5550 -0.1177 -0.0223 -0.0459 0.3376 -0.2491 -0.2424 -0.0758 -0.0075 0.0213 -0.1492 -0.1422 -0.1538 -0.1570 0.0981 0.0852 0.1048 0.0932 0.0830 0.0952 0.0820 0.0954 0.0753 0.0878 0.1251 0.1157 0.1481 0.1424 0.1623 0.1630
va: 1.2401 2.3595 1.9433 3.1963 3.8635 3.8911 4.2425 3.9243 3.9164 3.9098 3.6325 3.9123 3.9116 3.9595 3.9045 3.9096 0.9968 1.0174 0.9947 1.0091 1.0045 1.0061 1.0089 1.0078 1.0144 1.0039 1.0143 1.0223 0.9995 1.0059 0.9889 0.9875
dispcorr: -0.013342117 hartree
energy: -1455.403135844107
dipole: 24.31296 -23.92984 0.38312 3.19483 -3.11521 0.07962 -7.24603 5.57040 -1.67563
magnitude: 1.72071 au
magnitude: 4.37370 debye
