program: Orca
programVersion: 5.0.2
elementType: Cl S O N C C C C C C C C C C C C H H H H H H H H H H H H H H H H
charge: 0
multiplicity: 1
keywords: wb97x-d3
keywords: def2-TZVPP
keywords: def2/J RIJCOSX
keywords: DEFGRID2
keywords: scfconv7
keywords: smallprint printgap noloewdin
keywords: NOSOSCF
formula: C12H16ClNOS
InChI: InChI=1/C12H16ClNOS/c1-3-14(4-2)12(15)16-9-10-7-5-6-8-11(10)13/h5-8H,3-4,9H2,1-2H3
32 atoms
Cl -3.46165 -1.166562 1.687669
S  0.72608 -1.282814 -0.65594
O  1.273011 0.653251 1.04868
N  2.875029 0.283377 -0.509251
C  3.76642 1.257251 0.118211
C  3.36593 -0.467014 -1.656195
C  1.693332 0.04687 0.081365
C  4.493649 0.732235 1.346321
C  4.163565 -1.711112 -1.300105
C  -0.785947 -1.141406 0.314439
C  -1.74363 -0.050754 -0.093585
C  -3.010732 0.007619 0.488367
C  -1.437458 0.926818 -1.034553
C  -3.940104 0.975723 0.144416
C  -2.352693 1.906545 -1.389429
C  -3.607557 1.931051 -0.803149
H  4.490176 1.55843 -0.63851
H  3.195758 2.150499 0.373304
H  2.527516 -0.727547 -2.304351
H  3.982722 0.212256 -2.245478
H  3.79998 0.424178 2.128115
H  5.133172 -0.116302 1.104122
H  5.127425 1.518204 1.759231
H  3.584738 -2.39919 -0.683013
H  4.446349 -2.238836 -2.211757
H  5.080241 -1.463351 -0.765117
H  -0.518832 -1.052769 1.368166
H  -1.262963 -2.11745 0.201435
H  -0.469663 0.915947 -1.518507
H  -4.915568 0.982574 0.612108
H  -2.080775 2.649284 -2.127809
H  -4.330699 2.687408 -1.078029
elementType: Cl S O N C H
totalener: -1455.39747893 hartree
nucrepener: 1330.63422902 hartree
electener: -2786.03170796 hartree
oneelecener: -4640.47070605 hartree
twoeener: 1854.43899809 hartree
cpcmener: -0.02022751 hartree
kineticenergy: 1451.32187260 hartree
xcener: -99.504311761194 hartree
chargesum: 0.0000000
charge: -0.095357 -0.134142 -0.507108 -0.125552 -0.024668 -0.045562 0.305060 -0.259096 -0.255210 -0.008319 -0.043481 0.016122 -0.145887 -0.134068 -0.150964 -0.165755 0.090910 0.093356 0.097578 0.097420 0.087013 0.084735 0.097821 0.080330 0.098671 0.093084 0.123071 0.136786 0.139600 0.138712 0.157473 0.157429
qa: -0.0954 -0.1341 -0.5071 -0.1256 -0.0247 -0.0456 0.3051 -0.2591 -0.2552 -0.0083 -0.0435 0.0161 -0.1459 -0.1341 -0.1510 -0.1658 0.0909 0.0934 0.0976 0.0974 0.0870 0.0847 0.0978 0.0803 0.0987 0.0931 0.1231 0.1368 0.1396 0.1387 0.1575 0.1574
va: 1.2357 2.3340 1.9961 3.1961 3.8616 3.8685 4.2462 3.9062 3.9075 3.8748 3.6748 3.9363 3.8637 3.9571 3.9452 3.9304 1.0030 1.0110 1.0115 1.0017 1.0123 1.0021 1.0067 1.0142 1.0093 0.9996 1.0292 1.0067 1.0171 1.0076 0.9914 0.9895
dispcorr: -0.014309440 hartree
energy: -1455.411788372913
dipole: 30.91871 -29.53959 1.37913 5.05118 -4.83760 0.21358 -7.72413 6.16449 -1.55963
magnitude: 2.09286 au
magnitude: 5.31963 debye
