program: Orca
programVersion: 5.0.2
elementType: Cl S O N C C C C C C C C C C C C H H H H H H H H H H H H H H H H
charge: 0
multiplicity: 1
keywords: wb97x-d3
keywords: def2-TZVPP
keywords: def2/J RIJCOSX
keywords: DEFGRID2
keywords: scfconv7
keywords: smallprint printgap noloewdin
keywords: NOSOSCF
formula: C12H16ClNOS
InChI: InChI=1/C12H16ClNOS/c1-3-14(4-2)12(15)16-9-10-7-5-6-8-11(10)13/h5-8H,3-4,9H2,1-2H3
32 atoms
Cl -2.646009 -1.966111 0.264712
S  0.570346 -1.009932 -0.428856
O  1.506949 1.420634 -0.863229
N  2.748142 0.154951 0.546973
C  3.727831 1.224502 0.719936
C  3.024373 -1.139951 1.155975
C  1.704176 0.37565 -0.270336
C  4.86999 1.187986 -0.281137
C  3.690912 -2.147706 0.232499
C  -0.76087 -0.229174 -1.389922
C  -1.760852 0.470439 -0.524894
C  -2.663921 -0.231148 0.272808
C  -1.81668 1.86161 -0.485391
C  -3.585786 0.414472 1.080434
C  -2.732166 2.52525 0.317292
C  -3.615899 1.800815 1.10289
H  3.212087 2.181969 0.662289
H  4.117442 1.14342 1.736179
H  3.666154 -0.953598 2.016917
H  2.099785 -1.552789 1.566197
H  5.51691 2.0540 -0.132879
H  5.486246 0.296388 -0.164475
H  4.503278 1.219498 -1.308127
H  3.831109 -3.090354 0.763807
H  3.089827 -2.355891 -0.652771
H  4.671089 -1.805346 -0.097427
H  -1.215875 -1.043655 -1.954404
H  -0.320264 0.453793 -2.113841
H  -1.130865 2.430882 -1.099396
H  -4.274952 -0.158065 1.68708
H  -2.753038 3.607072 0.328502
H  -4.333705 2.307823 1.734204
elementType: Cl S O N C H
totalener: -1455.39819400 hartree
nucrepener: 1347.31858733 hartree
electener: -2802.71678133 hartree
oneelecener: -4674.08206039 hartree
twoeener: 1871.36527906 hartree
cpcmener: -0.01848257 hartree
kineticenergy: 1451.33399584 hartree
xcener: -99.505507724939 hartree
chargesum: 0.0000000
charge: -0.091083 -0.118052 -0.518173 -0.129183 -0.018429 -0.047439 0.320139 -0.266104 -0.250482 -0.094893 0.026351 -0.002889 -0.143771 -0.137994 -0.149532 -0.164616 0.088761 0.092499 0.095524 0.097451 0.097709 0.088079 0.087981 0.096628 0.079929 0.090063 0.151171 0.123396 0.140986 0.139366 0.158088 0.158518
qa: -0.0911 -0.1181 -0.5182 -0.1292 -0.0184 -0.0474 0.3201 -0.2661 -0.2505 -0.0949 0.0264 -0.0029 -0.1438 -0.1380 -0.1495 -0.1646 0.0888 0.0925 0.0955 0.0975 0.0977 0.0881 0.0880 0.0966 0.0799 0.0901 0.1512 0.1234 0.1410 0.1394 0.1581 0.1585
va: 1.2393 2.3235 1.9808 3.1955 3.8471 3.8744 4.2638 3.9118 3.8981 3.8077 3.5319 3.9467 3.8926 3.9640 3.9202 3.9261 1.0192 1.0034 1.0007 1.0109 1.0076 1.0001 1.0072 1.0094 1.0210 1.0016 1.0044 1.0388 1.0150 1.0063 0.9905 0.9889
dispcorr: -0.014133087 hartree
energy: -1455.412327086766
dipole: 27.35545 -26.52660 0.82885 7.07894 -7.10494 -0.02599 1.60538 -0.75241 0.85297
magnitude: 1.18963 au
magnitude: 3.02380 debye
