program: Orca
programVersion: 5.0.2
elementType: Cl S O N C C C C C C C C C C C C H H H H H H H H H H H H H H H H
charge: 0
multiplicity: 1
keywords: wb97x-d3
keywords: def2-TZVPP
keywords: def2/J RIJCOSX
keywords: DEFGRID2
keywords: scfconv7
keywords: smallprint printgap noloewdin
keywords: NOSOSCF
formula: C12H16ClNOS
InChI: InChI=1/C12H16ClNOS/c1-3-14(4-2)12(15)16-9-10-7-5-6-8-11(10)13/h5-8H,3-4,9H2,1-2H3
32 atoms
Cl -3.406402 -1.248488 1.644168
S  0.749485 -1.285343 -0.763692
O  1.243692 0.583643 1.026822
N  2.861338 0.315797 -0.540739
C  3.680811 1.370467 0.05104
C  3.410996 -0.448827 -1.65272
C  1.688312 0.022646 0.043298
C  4.631117 0.888321 1.13309
C  4.111995 -1.736769 -1.249801
C  -0.774551 -1.208096 0.194971
C  -1.713554 -0.072332 -0.121963
C  -2.956615 -0.011623 0.509339
C  -1.413997 0.945624 -1.021232
C  -3.863341 1.006965 0.263688
C  -2.308107 1.973462 -1.28094
C  -3.535144 2.006869 -0.638224
H  4.242254 1.833791 -0.761086
H  3.022082 2.140223 0.450341
H  2.620219 -0.657714 -2.376875
H  4.112234 0.204865 -2.171036
H  5.380363 0.2001 0.742278
H  5.160613 1.740874 1.560991
H  4.096597 0.389509 1.942116
H  4.984806 -1.543343 -0.627106
H  3.450126 -2.40987 -0.704325
H  4.452874 -2.262047 -2.142902
H  -0.52295 -1.218791 1.256307
H  -1.262154 -2.163963 -0.011999
H  -0.466972 0.932095 -1.544809
H  -4.818372 1.018426 0.771858
H  -2.040414 2.747409 -1.988109
H  -4.240218 2.803726 -0.834538
elementType: Cl S O N C H
totalener: -1455.39710773 hartree
nucrepener: 1332.82312596 hartree
electener: -2788.22023369 hartree
oneelecener: -4644.87925527 hartree
twoeener: 1856.65902158 hartree
cpcmener: -0.02041436 hartree
kineticenergy: 1451.32476839 hartree
xcener: -99.505089676067 hartree
chargesum: 0.0000000
charge: -0.095283 -0.133203 -0.506211 -0.125162 -0.020451 -0.046907 0.306774 -0.264739 -0.251933 -0.017068 -0.034985 0.016549 -0.151662 -0.132239 -0.148020 -0.168403 0.092520 0.089922 0.098030 0.097100 0.087471 0.098114 0.088114 0.091232 0.080719 0.097758 0.120057 0.140039 0.138379 0.138210 0.157700 0.157581
qa: -0.0953 -0.1332 -0.5062 -0.1252 -0.0205 -0.0469 0.3068 -0.2647 -0.2519 -0.0171 -0.0350 0.0165 -0.1517 -0.1322 -0.1480 -0.1684 0.0925 0.0899 0.0980 0.0971 0.0875 0.0981 0.0881 0.0912 0.0807 0.0978 0.1201 0.1400 0.1384 0.1382 0.1577 0.1576
va: 1.2361 2.3379 1.9971 3.1992 3.8516 3.8735 4.2391 3.9110 3.9032 3.8882 3.6585 3.9346 3.8687 3.9566 3.9410 3.9326 1.0033 1.0172 1.0086 1.0011 1.0006 1.0072 1.0078 1.0012 1.0177 1.0093 1.0293 1.0050 1.0187 1.0077 0.9911 0.9895
dispcorr: -0.014303440 hartree
energy: -1455.411411171918
dipole: 30.84761 -29.45607 1.39154 5.83102 -5.51707 0.31395 -7.73085 6.19171 -1.53914
magnitude: 2.09855 au
magnitude: 5.33409 debye
