program: Orca
programVersion: 5.0.2
elementType: Cl S O N C C C C C C C C C C C C H H H H H H H H H H H H H H H H
charge: 0
multiplicity: 1
keywords: wb97x-d3
keywords: def2-TZVPP
keywords: def2/J RIJCOSX
keywords: DEFGRID2
keywords: scfconv7
keywords: smallprint printgap noloewdin
keywords: NOSOSCF
formula: C12H16ClNOS
InChI: InChI=1/C12H16ClNOS/c1-3-14(4-2)12(15)16-9-10-7-5-6-8-11(10)13/h5-8H,3-4,9H2,1-2H3
32 atoms
Cl -3.551104 -1.558144 -0.93139
S  0.779849 -1.061842 1.08954
O  1.164387 -0.058048 -1.316745
N  2.971368 0.020617 0.044998
C  3.801907 0.619134 -0.99554
C  3.590184 -0.201652 1.343032
C  1.696583 -0.273138 -0.24402
C  3.67372 2.130948 -1.051121
C  4.280322 -1.549014 1.454952
C  -0.830478 -1.220746 0.295942
C  -1.681675 0.022167 0.241721
C  -2.963868 -0.047104 -0.305373
C  -1.268027 1.260173 0.722256
C  -3.802952 1.054168 -0.367873
C  -2.094579 2.373471 0.67156
C  -3.364438 2.272985 0.126099
H  4.834391 0.335774 -0.786777
H  3.550841 0.176519 -1.958885
H  4.310208 0.603181 1.500236
H  2.848362 -0.081478 2.134318
H  3.944446 2.589742 -0.098717
H  4.339512 2.535592 -1.815293
H  2.656605 2.436099 -1.298919
H  3.576881 -2.372375 1.32719
H  5.068042 -1.655786 0.707499
H  4.740531 -1.652331 2.43831
H  -1.337507 -1.992522 0.880755
H  -0.687438 -1.639495 -0.700661
H  -0.283913 1.357391 1.161985
H  -4.791546 0.960649 -0.797575
H  -1.740161 3.32023 1.057672
H  -4.017014 3.135545 0.081908
elementType: Cl S O N C H
totalener: -1455.39895935 hartree
nucrepener: 1332.80923081 hartree
electener: -2788.20819017 hartree
oneelecener: -4644.86411833 hartree
twoeener: 1856.65592817 hartree
cpcmener: -0.02055582 hartree
kineticenergy: 1451.32062749 hartree
xcener: -99.503744190513 hartree
chargesum: 0.0000000
charge: -0.094871 -0.134974 -0.509066 -0.115479 -0.024340 -0.053358 0.304718 -0.250363 -0.237995 -0.013832 -0.034936 0.015979 -0.153653 -0.133513 -0.146937 -0.168635 0.095804 0.087734 0.103113 0.093349 0.081464 0.094798 0.084537 0.077606 0.085783 0.094383 0.142459 0.118623 0.137525 0.138907 0.157627 0.157542
qa: -0.0949 -0.1350 -0.5091 -0.1155 -0.0243 -0.0534 0.3047 -0.2504 -0.2380 -0.0138 -0.0349 0.0160 -0.1537 -0.1335 -0.1469 -0.1686 0.0958 0.0877 0.1031 0.0933 0.0815 0.0948 0.0845 0.0776 0.0858 0.0944 0.1425 0.1186 0.1375 0.1389 0.1576 0.1575
va: 1.2362 2.3378 1.9927 3.1777 3.8663 3.8888 4.2505 3.9223 3.9165 3.8816 3.6520 3.9362 3.8709 3.9557 3.9409 3.9330 0.9968 1.0157 0.9951 1.0117 1.0045 1.0065 1.0102 1.0137 1.0042 1.0085 1.0039 1.0314 1.0203 1.0074 0.9910 0.9894
dispcorr: -0.014156645 hartree
energy: -1455.413115996388
dipole: 30.17077 -28.60071 1.57006 9.91498 -9.19198 0.72300 4.36843 -3.14221 1.22621
magnitude: 2.11930 au
magnitude: 5.38683 debye
