program: Orca
programVersion: 5.0.2
elementType: Cl S O N C C C C C C C C C C C C H H H H H H H H H H H H H H H H
charge: 0
multiplicity: 1
keywords: wb97x-d3
keywords: def2-TZVPP
keywords: def2/J RIJCOSX
keywords: DEFGRID2
keywords: scfconv7
keywords: smallprint printgap noloewdin
keywords: NOSOSCF
formula: C12H16ClNOS
InChI: InChI=1/C12H16ClNOS/c1-3-14(4-2)12(15)16-9-10-7-5-6-8-11(10)13/h5-8H,3-4,9H2,1-2H3
32 atoms
Cl -2.086578 -1.909338 0.565694
S  0.521217 0.448398 -0.377886
O  2.053583 0.604264 1.753507
N  3.158795 0.20802 -0.18811
C  4.45198 0.208552 0.488672
C  3.110479 -0.169168 -1.59457
C  2.054904 0.417078 0.549767
C  4.878015 -1.147512 1.02425
C  2.806594 -1.638038 -1.843812
C  -0.654886 0.784507 0.970984
C  -2.025198 0.795792 0.365993
C  -2.754727 -0.368619 0.13408
C  -2.60253 2.004292 -0.018131
C  -4.017813 -0.33657 -0.437452
C  -3.86096 2.054693 -0.595309
C  -4.570145 0.8809 -0.803601
H  5.188497 0.575946 -0.226924
H  4.419279 0.935309 1.299068
H  2.388606 0.462167 -2.118806
H  4.078727 0.085569 -2.02521
H  5.042742 -1.868416 0.223686
H  5.815246 -1.047215 1.573665
H  4.134768 -1.559079 1.707791
H  1.851555 -1.934698 -1.410297
H  2.7540 -1.824241 -2.917371
H  3.581471 -2.284625 -1.433289
H  -0.432708 1.754034 1.413353
H  -0.553835 0.022356 1.741789
H  -2.047211 2.920008 0.145121
H  -4.565845 -1.255347 -0.597948
H  -4.28605 3.007695 -0.881103
H  -5.555655 0.905969 -1.249749
elementType: Cl S O N C H
totalener: -1455.39777337 hartree
nucrepener: 1329.20305524 hartree
electener: -2784.60082861 hartree
oneelecener: -4637.63009302 hartree
twoeener: 1853.02926441 hartree
cpcmener: -0.02040564 hartree
kineticenergy: 1451.33181645 hartree
xcener: -99.504050014479 hartree
chargesum: -0.0000000
charge: -0.086691 -0.111705 -0.516279 -0.133482 -0.018185 -0.046154 0.327814 -0.265625 -0.250843 -0.075518 -0.000800 0.021853 -0.150829 -0.139492 -0.151325 -0.154264 0.092139 0.088893 0.096375 0.096643 0.088210 0.097217 0.087540 0.078870 0.096201 0.091233 0.122920 0.112635 0.144340 0.139902 0.158909 0.159502
qa: -0.0867 -0.1117 -0.5163 -0.1335 -0.0182 -0.0462 0.3278 -0.2656 -0.2508 -0.0755 -0.0008 0.0219 -0.1508 -0.1395 -0.1513 -0.1543 0.0921 0.0889 0.0964 0.0966 0.0882 0.0972 0.0875 0.0789 0.0962 0.0912 0.1229 0.1126 0.1443 0.1399 0.1589 0.1595
va: 1.2416 2.3576 1.9904 3.2058 3.8524 3.8884 4.2556 3.9103 3.9028 3.9161 3.6327 3.9207 3.9193 3.9633 3.9099 3.9159 1.0035 1.0176 1.0046 1.0008 1.0001 1.0074 1.0082 1.0204 1.0095 1.0013 1.0133 1.0236 1.0009 1.0067 0.9901 0.9887
dispcorr: -0.013693815 hartree
energy: -1455.411467181015
dipole: 23.10875 -22.80121 0.30754 1.52244 -1.13079 0.39165 -5.57971 4.10399 -1.47572
magnitude: 1.55747 au
magnitude: 3.95878 debye
