program: Orca
programVersion: 5.0.2
elementType: Cl S O N C C C C C C C C C C C C H H H H H H H H H H H H H H H H
charge: 0
multiplicity: 1
keywords: wb97x-d3
keywords: def2-TZVPP
keywords: def2/J RIJCOSX
keywords: DEFGRID2
keywords: scfconv7
keywords: smallprint printgap noloewdin
keywords: NOSOSCF
formula: C12H16ClNOS
InChI: InChI=1/C12H16ClNOS/c1-3-14(4-2)12(15)16-9-10-7-5-6-8-11(10)13/h5-8H,3-4,9H2,1-2H3
32 atoms
Cl -2.4545 -1.944033 0.422946
S  0.608939 -1.163326 -0.875175
O  1.524319 1.282884 -1.261563
N  2.97861 -0.131517 -0.261068
C  3.984889 0.923361 -0.167784
C  3.241112 -1.406018 0.393416
C  1.793816 0.184551 -0.810317
C  3.779942 1.886045 0.990506
C  2.786051 -1.469185 1.841659
C  -0.827823 -0.290688 -1.567009
C  -1.617847 0.450186 -0.534818
C  -2.389166 -0.21036 0.420677
C  -1.611837 1.842599 -0.501427
C  -3.120574 0.476115 1.376223
C  -2.338684 2.546462 0.446671
C  -3.091266 1.862397 1.388911
H  4.95359 0.432435 -0.076002
H  4.006306 1.472868 -1.108894
H  2.787665 -2.215015 -0.182862
H  4.315165 -1.581482 0.332654
H  4.546896 2.661619 0.959471
H  2.810104 2.379932 0.940018
H  3.858383 1.385304 1.95508
H  3.318767 -0.749353 2.462439
H  1.71711 -1.27716 1.936584
H  2.982817 -2.46292 2.246195
H  -1.422973 -1.071958 -2.041619
H  -0.489996 0.376726 -2.357336
H  -1.030019 2.380939 -1.237823
H  -3.711306 -0.065683 2.102709
H  -2.315746 3.628237 0.447654
H  -3.661879 2.400839 2.134115
elementType: Cl S O N C H
totalener: -1455.39842449 hartree
nucrepener: 1362.90857320 hartree
electener: -2818.30699769 hartree
oneelecener: -4705.30344193 hartree
twoeener: 1886.99644425 hartree
cpcmener: -0.01837491 hartree
kineticenergy: 1451.34123485 hartree
xcener: -99.506964284824 hartree
chargesum: 0.0000000
charge: -0.091178 -0.118958 -0.516688 -0.134635 -0.016554 -0.040963 0.322885 -0.263048 -0.254189 -0.092448 0.020794 0.002472 -0.142990 -0.138667 -0.150006 -0.164720 0.090287 0.089854 0.096029 0.095062 0.096944 0.086207 0.085886 0.092715 0.078272 0.096982 0.151707 0.123432 0.140038 0.138962 0.158136 0.158382
qa: -0.0912 -0.1190 -0.5167 -0.1346 -0.0166 -0.0410 0.3229 -0.2630 -0.2542 -0.0924 0.0208 0.0025 -0.1430 -0.1387 -0.1500 -0.1647 0.0903 0.0899 0.0960 0.0951 0.0969 0.0862 0.0859 0.0927 0.0783 0.0970 0.1517 0.1234 0.1400 0.1390 0.1581 0.1584
va: 1.2388 2.3249 1.9827 3.2024 3.8578 3.8955 4.2604 3.9079 3.9038 3.8191 3.5245 3.9328 3.8951 3.9656 3.9204 3.9273 1.0043 1.0127 1.0035 1.0024 1.0073 1.0126 1.0011 1.0001 1.0166 1.0092 1.0040 1.0376 1.0159 1.0068 0.9904 0.9890
dispcorr: -0.014609638 hartree
energy: -1455.413034124522
dipole: 23.06769 -22.16518 0.90251 9.78320 -9.84197 -0.05877 6.83902 -6.09169 0.74733
magnitude: 1.17324 au
magnitude: 2.98213 debye
