program: Orca
programVersion: 5.0.2
elementType: Cl S O N C C C C C C C C C C C C H H H H H H H H H H H H H H H H
charge: 0
multiplicity: 1
keywords: wb97x-d3
keywords: def2-TZVPP
keywords: def2/J RIJCOSX
keywords: DEFGRID2
keywords: scfconv7
keywords: smallprint printgap noloewdin
keywords: NOSOSCF
formula: C12H16ClNOS
InChI: InChI=1/C12H16ClNOS/c1-3-14(4-2)12(15)16-9-10-7-5-6-8-11(10)13/h5-8H,3-4,9H2,1-2H3
32 atoms
Cl -3.218115 -0.759995 2.017146
S  0.729881 -1.329867 -0.663978
O  1.148187 0.667026 1.00238
N  2.818947 0.309744 -0.486984
C  3.660942 1.321681 0.147083
C  3.372784 -0.462791 -1.589784
C  1.625009 0.049399 0.069171
C  4.401902 0.824989 1.37858
C  4.137741 -1.707673 -1.169833
C  -0.815993 -1.199034 0.2531
C  -1.753596 -0.097343 -0.170203
C  -2.901123 0.162538 0.579518
C  -1.561148 0.671226 -1.313495
C  -3.819756 1.133679 0.214503
C  -2.469309 1.64677 -1.696108
C  -3.601848 1.87986 -0.932828
H  4.37368 1.659913 -0.604541
H  3.047748 2.186059 0.401575
H  2.571868 -0.726366 -2.283247
H  4.029127 0.203593 -2.149904
H  5.087595 0.012963 1.137942
H  4.99017 1.638433 1.805796
H  3.715485 0.47435 2.149273
H  4.461482 -2.254719 -2.056181
H  5.028196 -1.459948 -0.592652
H  3.521848 -2.380178 -0.571839
H  -0.583578 -1.135991 1.315243
H  -1.29796 -2.168871 0.103145
H  -0.684359 0.499754 -1.924199
H  -4.6991 1.303741 0.821286
H  -2.287792 2.2235 -2.593522
H  -4.318053 2.637001 -1.223584
elementType: Cl S O N C H
totalener: -1455.39702755 hartree
nucrepener: 1335.36844479 hartree
electener: -2790.76547234 hartree
oneelecener: -4650.08104632 hartree
twoeener: 1859.31557398 hartree
cpcmener: -0.02064357 hartree
kineticenergy: 1451.33228200 hartree
xcener: -99.506263371584 hartree
chargesum: 0.0000000
charge: -0.094956 -0.134495 -0.508337 -0.126551 -0.019589 -0.043676 0.315839 -0.262770 -0.257089 -0.029845 -0.018161 0.014783 -0.156788 -0.133903 -0.148062 -0.169181 0.090231 0.092057 0.098288 0.096780 0.085947 0.097943 0.087254 0.098212 0.093295 0.080358 0.113581 0.146621 0.137804 0.138712 0.158134 0.157562
qa: -0.0950 -0.1345 -0.5083 -0.1266 -0.0196 -0.0437 0.3158 -0.2628 -0.2571 -0.0298 -0.0182 0.0148 -0.1568 -0.1339 -0.1481 -0.1692 0.0902 0.0921 0.0983 0.0968 0.0859 0.0979 0.0873 0.0982 0.0933 0.0804 0.1136 0.1466 0.1378 0.1387 0.1581 0.1576
va: 1.2359 2.3369 1.9937 3.1993 3.8586 3.8705 4.2292 3.9101 3.9031 3.8862 3.6271 3.9424 3.8783 3.9559 3.9378 3.9330 1.0036 1.0126 1.0094 1.0020 1.0015 1.0068 1.0107 1.0095 0.9997 1.0157 1.0359 1.0006 1.0216 1.0074 0.9905 0.9894
dispcorr: -0.014321893 hartree
energy: -1455.411349438326
dipole: 29.74535 -28.39926 1.34609 3.67436 -3.59929 0.07507 -8.67691 7.04199 -1.63491
magnitude: 2.11909 au
magnitude: 5.38630 debye
