program: Orca
programVersion: 5.0.2
elementType: Cl S O N C C C C C C C C C C C C H H H H H H H H H H H H H H H H
charge: 0
multiplicity: 1
keywords: wb97x-d3
keywords: def2-TZVPP
keywords: def2/J RIJCOSX
keywords: DEFGRID2
keywords: scfconv7
keywords: smallprint printgap noloewdin
keywords: NOSOSCF
formula: C12H16ClNOS
InChI: InChI=1/C12H16ClNOS/c1-3-14(4-2)12(15)16-9-10-7-5-6-8-11(10)13/h5-8H,3-4,9H2,1-2H3
32 atoms
Cl -2.690341 -1.870448 -0.547811
S  0.5684 -1.131019 0.37164
O  1.551562 1.164219 1.247545
N  2.889479 0.028482 -0.176152
C  3.972552 0.992966 -0.009745
C  3.127898 -1.083521 -1.083815
C  1.762051 0.203687 0.528739
C  3.858028 2.184192 -0.943011
C  3.794816 -2.274086 -0.418414
C  -0.78827 -0.468902 1.385291
C  -1.736475 0.387507 0.608286
C  -2.649086 -0.153668 -0.296153
C  -1.736649 1.771142 0.767784
C  -3.527033 0.638735 -1.017494
C  -2.607514 2.580199 0.054103
C  -3.503238 2.013924 -0.840238
H  4.006847 1.323282 1.027845
H  4.907243 0.461517 -0.19336
H  2.192076 -1.380526 -1.55998
H  3.756561 -0.707716 -1.892757
H  4.710637 2.850333 -0.804182
H  3.84742 1.873047 -1.988821
H  2.951346 2.757261 -0.748509
H  3.971382 -3.060958 -1.152625
H  4.75923 -2.000208 0.011946
H  3.175149 -2.691195 0.375757
H  -0.362751 0.078498 2.224081
H  -1.285454 -1.347501 1.797208
H  -1.041979 2.217279 1.467463
H  -4.225075 0.187643 -1.710188
H  -2.58503 3.652396 0.197666
H  -4.188006 2.635814 -1.401661
elementType: Cl S O N C H
totalener: -1455.39994259 hartree
nucrepener: 1344.80589640 hartree
electener: -2800.20583899 hartree
oneelecener: -4669.02836346 hartree
twoeener: 1868.82252446 hartree
cpcmener: -0.01842811 hartree
kineticenergy: 1451.33678660 hartree
xcener: -99.505340875205 hartree
chargesum: 0.0000000
charge: -0.091401 -0.118697 -0.520246 -0.119097 -0.024089 -0.053840 0.319035 -0.249009 -0.238997 -0.096489 0.028673 -0.005218 -0.143015 -0.137832 -0.150389 -0.165317 0.086164 0.095803 0.093850 0.102532 0.093954 0.080654 0.083539 0.093744 0.085840 0.075987 0.124254 0.150680 0.142225 0.140430 0.158168 0.158099
qa: -0.0914 -0.1187 -0.5202 -0.1191 -0.0241 -0.0538 0.3190 -0.2490 -0.2390 -0.0965 0.0287 -0.0052 -0.1430 -0.1378 -0.1504 -0.1653 0.0862 0.0958 0.0938 0.1025 0.0940 0.0807 0.0835 0.0937 0.0858 0.0760 0.1243 0.1507 0.1422 0.1404 0.1582 0.1581
va: 1.2391 2.3198 1.9782 3.1734 3.8652 3.8922 4.2696 3.9231 3.9106 3.8037 3.5284 3.9534 3.8948 3.9623 3.9224 3.9267 1.0163 0.9967 1.0135 0.9943 1.0063 1.0046 1.0109 1.0085 1.0042 1.0160 1.0387 1.0054 1.0153 1.0059 0.9905 0.9892
dispcorr: -0.013940993 hartree
energy: -1455.413883583831
dipole: 26.03883 -25.12482 0.91400 8.72460 -8.66775 0.05685 -2.83102 2.03853 -0.79250
magnitude: 1.21107 au
magnitude: 3.07828 debye
