program: Orca
programVersion: 5.0.2
elementType: Cl S O N C C C C C C C C C C C C H H H H H H H H H H H H H H H H
charge: 0
multiplicity: 1
keywords: wb97x-d3
keywords: def2-TZVPP
keywords: def2/J RIJCOSX
keywords: DEFGRID2
keywords: scfconv7
keywords: smallprint printgap noloewdin
keywords: NOSOSCF
formula: C12H16ClNOS
InChI: InChI=1/C12H16ClNOS/c1-3-14(4-2)12(15)16-9-10-7-5-6-8-11(10)13/h5-8H,3-4,9H2,1-2H3
32 atoms
Cl -2.762141 -1.930761 0.256046
S  0.55461 -1.095631 -0.381047
O  1.460061 1.356972 -0.763152
N  2.740238 0.074075 0.589281
C  3.690216 1.164647 0.766814
C  3.037441 -1.221679 1.172567
C  1.67038 0.304032 -0.205541
C  4.686794 1.3281 -0.371613
C  3.814635 -2.158908 0.258765
C  -0.754436 -0.298022 -1.357318
C  -1.734931 0.453456 -0.513904
C  -2.696495 -0.199479 0.253946
C  -1.715056 1.844653 -0.474697
C  -3.610328 0.497235 1.026919
C  -2.621869 2.556452 0.293555
C  -3.571331 1.882094 1.044657
H  3.133643 2.091944 0.900892
H  4.219266 0.977992 1.70291
H  3.602292 -1.042294 2.088942
H  2.107553 -1.696043 1.493555
H  5.360164 2.158788 -0.15715
H  5.297153 0.43575 -0.509416
H  4.177499 1.545091 -1.308864
H  3.986593 -3.112608 0.758524
H  3.264588 -2.358826 -0.660327
H  4.786369 -1.745228 -0.009073
H  -1.234798 -1.113812 -1.897403
H  -0.284493 0.356521 -2.088357
H  -0.964403 2.368595 -1.049891
H  -4.345007 -0.041721 1.6089
H  -2.583964 3.637323 0.306084
H  -4.284248 2.428741 1.647349
totalener: -1455.38137969 hartree
nucrepener: 1348.66865545 hartree
electener: -2804.05003514 hartree
oneelecener: -4676.13386994 hartree
twoeener: 1872.08383480 hartree
kineticenergy: 1451.37056336 hartree
xcener: -99.509643607061 hartree
chargesum: -0.0000000
charge: -0.079824 -0.105335 -0.439425 -0.141884 -0.023500 -0.072095 0.317398 -0.248809 -0.228866 -0.127922 0.021924 0.003979 -0.104482 -0.125026 -0.125034 -0.131113 0.093148 0.073749 0.080161 0.097170 0.086121 0.070971 0.099809 0.086820 0.084671 0.079140 0.142023 0.123979 0.124406 0.116299 0.126398 0.125145
qa: -0.0798 -0.1053 -0.4394 -0.1419 -0.0235 -0.0721 0.3174 -0.2488 -0.2289 -0.1279 0.0219 0.0040 -0.1045 -0.1250 -0.1250 -0.1311 0.0931 0.0737 0.0802 0.0972 0.0861 0.0710 0.0998 0.0868 0.0847 0.0791 0.1420 0.1240 0.1244 0.1163 0.1264 0.1251
va: 1.2526 2.3225 2.0571 3.1809 3.8820 3.9152 4.2406 3.9054 3.8948 3.8628 3.5600 4.0055 3.9315 4.0047 3.9709 3.9675 1.0144 1.0034 1.0034 1.0139 1.0103 1.0050 1.0125 1.0133 1.0202 1.0034 1.0065 1.0360 1.0231 1.0133 1.0004 0.9992
dispcorr: -0.014242938 hartree
energy: -1455.395622624811
dipole: 27.79364 -27.08366 0.70997 7.33762 -7.26666 0.07096 1.33062 -0.81109 0.51952
magnitude: 0.88261 au
magnitude: 2.24342 debye
