program: Orca
programVersion: 5.0.2
elementType: Cl S O N C C C C C C C C C C C C H H H H H H H H H H H H H H H H
charge: 0
multiplicity: 1
keywords: wb97x-d3
keywords: def2-TZVPP
keywords: def2/J RIJCOSX
keywords: DEFGRID2
keywords: scfconv7
keywords: smallprint printgap noloewdin
keywords: NOSOSCF
formula: C12H16ClNOS
InChI: InChI=1/C12H16ClNOS/c1-3-14(4-2)12(15)16-9-10-7-5-6-8-11(10)13/h5-8H,3-4,9H2,1-2H3
32 atoms
Cl -2.754482 -1.898718 -0.41983
S  0.576262 -1.097763 0.185059
O  1.494367 1.28908 0.855626
N  2.763063 0.17166 -0.644352
C  3.746845 1.246798 -0.64577
C  3.031789 -1.029908 -1.412777
C  1.695415 0.309725 0.173562
C  4.701825 1.222302 0.538345
C  3.801952 -2.103969 -0.657802
C  -0.700423 -0.441328 1.29813
C  -1.722896 0.391148 0.592312
C  -2.709988 -0.17909 -0.208021
C  -1.720187 1.776795 0.722886
C  -3.666203 0.590398 -0.849329
C  -2.669607 2.561013 0.088311
C  -3.644411 1.967483 -0.697776
H  4.304991 1.168394 -1.57997
H  3.221696 2.201269 -0.673429
H  2.090181 -1.437083 -1.78681
H  3.588912 -0.727851 -2.301231
H  5.407908 2.050034 0.463557
H  4.162051 1.330071 1.476721
H  5.278451 0.299275 0.577725
H  3.938439 -2.981174 -1.290954
H  4.789642 -1.755708 -0.357625
H  3.264938 -2.418479 0.236237
H  -0.207287 0.128109 2.083285
H  -1.150957 -1.322269 1.755213
H  -0.950151 2.239214 1.324798
H  -4.420043 0.113818 -1.460438
H  -2.645427 3.635744 0.207417
H  -4.390877 2.571517 -1.195958
totalener: -1455.38152248 hartree
nucrepener: 1347.47008978 hartree
electener: -2802.85161226 hartree
oneelecener: -4673.73182638 hartree
twoeener: 1870.88021412 hartree
kineticenergy: 1451.37714744 hartree
xcener: -99.511021128106 hartree
chargesum: 0.0000000
charge: -0.080176 -0.104383 -0.440430 -0.141532 -0.023199 -0.071455 0.316585 -0.248288 -0.230897 -0.128989 0.025638 0.001592 -0.105419 -0.124659 -0.124674 -0.131739 0.073207 0.093633 0.096676 0.081180 0.086046 0.099743 0.070852 0.086960 0.078601 0.085696 0.123089 0.142589 0.124855 0.116916 0.126388 0.125594
qa: -0.0802 -0.1044 -0.4404 -0.1415 -0.0232 -0.0715 0.3166 -0.2483 -0.2309 -0.1290 0.0256 0.0016 -0.1054 -0.1247 -0.1247 -0.1317 0.0732 0.0936 0.0967 0.0812 0.0860 0.0997 0.0709 0.0870 0.0786 0.0857 0.1231 0.1426 0.1249 0.1169 0.1264 0.1256
va: 1.2521 2.3228 2.0559 3.1786 3.8823 3.9128 4.2417 3.9071 3.8926 3.8609 3.5575 4.0067 3.9338 4.0042 3.9706 3.9678 1.0030 1.0137 1.0137 1.0030 1.0105 1.0129 1.0051 1.0132 1.0033 1.0204 1.0370 1.0062 1.0226 1.0131 1.0004 0.9991
dispcorr: -0.014216769 hartree
energy: -1455.395739246898
dipole: 27.75772 -27.05681 0.70092 7.30277 -7.18364 0.11914 -0.76310 0.26612 -0.49698
magnitude: 0.86745 au
magnitude: 2.20488 debye
