program: Orca
programVersion: 5.0.2
elementType: Cl S O N C C C C C C C C C C C C H H H H H H H H H H H H H H H H
charge: 0
multiplicity: 1
keywords: wb97x-d3
keywords: def2-TZVPP
keywords: def2/J RIJCOSX
keywords: DEFGRID2
keywords: scfconv7
keywords: smallprint printgap noloewdin
keywords: NOSOSCF
formula: C12H16ClNOS
InChI: InChI=1/C12H16ClNOS/c1-3-14(4-2)12(15)16-9-10-7-5-6-8-11(10)13/h5-8H,3-4,9H2,1-2H3
32 atoms
Cl -3.465661 -1.647149 -1.023011
S  0.783556 -1.030523 1.126137
O  1.133906 -0.079129 -1.311367
N  2.94499 0.079039 0.038816
C  3.73926 0.709229 -1.005877
C  3.580553 -0.139431 1.324299
C  1.66923 -0.259989 -0.245888
C  4.463073 -0.301434 -1.880957
C  3.410217 1.031566 2.279493
C  -0.821078 -1.251173 0.335506
C  -1.740881 -0.057148 0.337297
C  -2.993135 -0.158646 -0.267841
C  -1.420932 1.158886 0.927849
C  -3.890545 0.895613 -0.28613
C  -2.3067 2.224833 0.920174
C  -3.544289 2.09549 0.3127
H  3.092315 1.339199 -1.614151
H  4.455684 1.37332 -0.51745
H  3.207089 -1.059904 1.776547
H  4.640922 -0.322331 1.137474
H  5.123129 -0.94185 -1.293861
H  3.750519 -0.935979 -2.405912
H  5.07343 0.208014 -2.627222
H  2.358727 1.193611 2.514032
H  3.937809 0.843323 3.214764
H  3.808145 1.952327 1.851605
H  -1.285563 -2.078954 0.875964
H  -0.651558 -1.59812 -0.683663
H  -0.458298 1.268922 1.408844
H  -4.851389 0.774264 -0.767003
H  -2.024816 3.157943 1.389225
H  -4.242002 2.921979 0.300909
totalener: -1455.37985113 hartree
nucrepener: 1332.04777048 hartree
electener: -2787.42762162 hartree
oneelecener: -4642.68253503 hartree
twoeener: 1855.25491342 hartree
kineticenergy: 1451.36575655 hartree
xcener: -99.508442270248 hartree
chargesum: -0.0000000
charge: -0.082069 -0.138956 -0.403602 -0.128113 -0.037890 -0.082052 0.279921 -0.233350 -0.216682 -0.044067 -0.031607 0.021124 -0.090315 -0.124999 -0.132534 -0.126315 0.094300 0.080287 0.093721 0.089708 0.065141 0.096832 0.085154 0.080909 0.086379 0.074302 0.131089 0.126176 0.104404 0.115704 0.122802 0.124597
qa: -0.0821 -0.1390 -0.4036 -0.1281 -0.0379 -0.0821 0.2799 -0.2333 -0.2167 -0.0441 -0.0316 0.0211 -0.0903 -0.1250 -0.1325 -0.1263 0.0943 0.0803 0.0937 0.0897 0.0651 0.0968 0.0852 0.0809 0.0864 0.0743 0.1311 0.1262 0.1044 0.1157 0.1228 0.1246
va: 1.2514 2.3273 2.0977 3.1426 3.8912 3.9333 4.2612 3.9220 3.9225 3.9254 3.7101 3.9916 3.9110 4.0063 3.9994 3.9647 1.0180 0.9947 1.0082 0.9944 1.0072 1.0099 1.0097 1.0101 1.0129 1.0060 1.0041 1.0300 1.0224 1.0148 1.0012 0.9997
dispcorr: -0.014096291 hartree
energy: -1455.393947425774
dipole: 29.54782 -28.43562 1.11220 10.47076 -9.90349 0.56727 4.69692 -3.92636 0.77056
magnitude: 1.46716 au
magnitude: 3.72922 debye
