program: Orca
programVersion: 5.0.2
elementType: Cl S O N C C C C C C C C C C C C H H H H H H H H H H H H H H H H
charge: 0
multiplicity: 1
keywords: wb97x-d3
keywords: def2-TZVPP
keywords: def2/J RIJCOSX
keywords: DEFGRID2
keywords: scfconv7
keywords: smallprint printgap noloewdin
keywords: NOSOSCF
formula: C12H16ClNOS
InChI: InChI=1/C12H16ClNOS/c1-3-14(4-2)12(15)16-9-10-7-5-6-8-11(10)13/h5-8H,3-4,9H2,1-2H3
32 atoms
Cl -2.705133 -1.817745 -0.69259
S  0.574397 -1.195827 0.300795
O  1.507939 1.096822 1.2365
N  2.898129 -0.001794 -0.167234
C  3.940565 0.999178 0.006207
C  3.179217 -1.113142 -1.056502
C  1.743986 0.152834 0.516981
C  3.81693 2.155838 -0.972317
C  3.844974 -2.289987 -0.359134
C  -0.790195 -0.560344 1.318187
C  -1.702019 0.357533 0.568461
C  -2.618548 -0.119022 -0.366116
C  -1.660654 1.731145 0.78932
C  -3.469821 0.730821 -1.05265
C  -2.504991 2.594501 0.110568
C  -3.411274 2.094007 -0.811088
H  3.913514 1.368823 1.03003
H  4.901978 0.496048 -0.119321
H  2.260585 -1.432454 -1.55217
H  3.822361 -0.736196 -1.855047
H  2.88151 2.691558 -0.818671
H  4.636953 2.861292 -0.833871
H  3.846667 1.811602 -2.007189
H  4.065907 -3.081799 -1.075423
H  4.784695 -1.994712 0.109478
H  3.197644 -2.7056 0.41218
H  -0.362918 -0.063407 2.186787
H  -1.316175 -1.449486 1.665904
H  -0.943134 2.120448 1.498524
H  -4.171958 0.326418 -1.768606
H  -2.452523 3.657904 0.301532
H  -4.07554 2.759844 -1.345669
totalener: -1455.38281685 hartree
nucrepener: 1347.98918046 hartree
electener: -2803.37199732 hartree
oneelecener: -4674.75907915 hartree
twoeener: 1871.38708184 hartree
kineticenergy: 1451.37096269 hartree
xcener: -99.509421762432 hartree
chargesum: -0.0000000
charge: -0.079522 -0.104727 -0.439124 -0.131090 -0.036830 -0.086482 0.313553 -0.233124 -0.214601 -0.128967 0.024134 0.001850 -0.104183 -0.124453 -0.125696 -0.131392 0.092250 0.080500 0.096238 0.088422 0.095645 0.083804 0.065753 0.084125 0.072501 0.082932 0.122410 0.142735 0.125476 0.116449 0.126237 0.125176
qa: -0.0795 -0.1047 -0.4391 -0.1311 -0.0368 -0.0865 0.3136 -0.2331 -0.2146 -0.1290 0.0241 0.0018 -0.1042 -0.1245 -0.1257 -0.1314 0.0923 0.0805 0.0962 0.0884 0.0956 0.0838 0.0658 0.0841 0.0725 0.0829 0.1224 0.1427 0.1255 0.1164 0.1262 0.1252
va: 1.2531 2.3201 2.0582 3.1477 3.8887 3.9307 4.2518 3.9244 3.9060 3.8636 3.5603 4.0064 3.9324 4.0038 3.9723 3.9673 1.0194 0.9950 1.0151 0.9941 1.0107 1.0095 1.0075 1.0122 1.0066 1.0197 1.0369 1.0060 1.0222 1.0132 1.0004 0.9992
dispcorr: -0.014011101 hartree
energy: -1455.396827954477
dipole: 26.20467 -25.45456 0.75011 8.58923 -8.45104 0.13819 -2.05403 1.58325 -0.47078
magnitude: 0.89632 au
magnitude: 2.27826 debye
