program: Orca
programVersion: 5.0.2
elementType: Cl S O N C C C C C C C C C C C C H H H H H H H H H H H H H H H H
charge: 0
multiplicity: 1
keywords: wb97x-d3
keywords: def2-TZVPP
keywords: def2/J RIJCOSX
keywords: DEFGRID2
keywords: scfconv7
keywords: smallprint printgap noloewdin
keywords: NOSOSCF
formula: C12H16ClNOS
InChI: InChI=1/C12H16ClNOS/c1-3-14(4-2)12(15)16-9-10-7-5-6-8-11(10)13/h5-8H,3-4,9H2,1-2H3
32 atoms
Cl -3.384111 -0.870133 1.892422
S  0.775926 -1.43211 -0.425147
O  1.289247 0.707377 1.035498
N  3.000225 0.017109 -0.277666
C  3.854003 1.109268 0.167553
C  3.562061 -0.933776 -1.218424
C  1.749153 -0.059798 0.225722
C  4.63578 0.76903 1.426179
C  3.331278 -0.552335 -2.672446
C  -0.758727 -1.151591 0.476292
C  -1.705994 -0.133051 -0.104104
C  -2.950035 0.060233 0.494778
C  -1.413465 0.642535 -1.218622
C  -3.866551 0.978543 0.010602
C  -2.317393 1.567812 -1.716327
C  -3.546719 1.737875 -1.102429
H  4.536142 1.346286 -0.651888
H  3.242047 1.994742 0.331762
H  4.632909 -0.998785 -1.013858
H  3.171416 -1.933351 -1.018632
H  3.96179 0.590345 2.262709
H  5.251389 -0.121275 1.287558
H  5.299049 1.590841 1.69775
H  3.747891 0.430671 -2.894811
H  3.80832 -1.273809 -3.336172
H  2.26791 -0.532116 -2.908617
H  -0.507342 -0.889943 1.504758
H  -1.240077 -2.131191 0.511124
H  -0.459761 0.512551 -1.711838
H  -4.821199 1.095095 0.504571
H  -2.055784 2.157176 -2.584835
H  -4.258719 2.457624 -1.483226
totalener: -1455.37999039 hartree
nucrepener: 1330.85516018 hartree
electener: -2786.23515057 hartree
oneelecener: -4640.28597710 hartree
twoeener: 1854.05082652 hartree
kineticenergy: 1451.36563516 hartree
xcener: -99.508561804098 hartree
chargesum: 0.0000000
charge: -0.082545 -0.136018 -0.403820 -0.127769 -0.040395 -0.084543 0.274752 -0.233940 -0.217125 -0.035161 -0.031655 0.014454 -0.090802 -0.122988 -0.126130 -0.128517 0.080785 0.094890 0.089786 0.095722 0.097558 0.065642 0.085223 0.074539 0.086462 0.081218 0.127168 0.128453 0.102144 0.116050 0.122298 0.124264
qa: -0.0825 -0.1360 -0.4038 -0.1278 -0.0404 -0.0845 0.2748 -0.2339 -0.2171 -0.0352 -0.0317 0.0145 -0.0908 -0.1230 -0.1261 -0.1285 0.0808 0.0949 0.0898 0.0957 0.0976 0.0656 0.0852 0.0745 0.0865 0.0812 0.1272 0.1285 0.1021 0.1160 0.1223 0.1243
va: 1.2508 2.3285 2.0979 3.1400 3.8939 3.9262 4.2683 3.9188 3.9210 3.9211 3.7147 3.9905 3.9137 4.0020 3.9940 3.9674 0.9943 1.0174 0.9943 1.0095 1.0102 1.0073 1.0098 1.0059 1.0127 1.0117 1.0273 1.0066 1.0228 1.0143 1.0012 0.9998
dispcorr: -0.014079964 hartree
energy: -1455.394070354017
dipole: 29.42331 -28.35562 1.06769 5.90712 -5.87858 0.02854 -11.09764 10.12042 -0.97722
magnitude: 1.44767 au
magnitude: 3.67968 debye
