program: Orca
programVersion: 5.0.2
elementType: Cl S O N C C C C C C C C C C C C H H H H H H H H H H H H H H H H
charge: 0
multiplicity: 1
keywords: wb97x-d3
keywords: def2-TZVPP
keywords: def2/J RIJCOSX
keywords: DEFGRID2
keywords: scfconv7
keywords: smallprint printgap noloewdin
keywords: NOSOSCF
formula: C12H16ClNOS
InChI: InChI=1/C12H16ClNOS/c1-3-14(4-2)12(15)16-9-10-7-5-6-8-11(10)13/h5-8H,3-4,9H2,1-2H3
32 atoms
Cl -2.779688 -1.935781 -0.307833
S  0.562332 -1.048589 0.217226
O  1.486633 1.348049 0.846344
N  2.775509 0.18245 -0.59883
C  3.786173 1.232362 -0.580144
C  3.042764 -1.036969 -1.338694
C  1.690796 0.351568 0.19051
C  4.68503 1.21177 0.647786
C  3.792892 -2.100973 -0.550274
C  -0.724031 -0.359862 1.299377
C  -1.759916 0.419823 0.554074
C  -2.750749 -0.206753 -0.198197
C  -1.76441 1.811066 0.595018
C  -3.721002 0.514285 -0.873953
C  -2.726407 2.547078 -0.077348
C  -3.707587 1.898207 -0.810267
H  4.38483 1.114956 -1.484624
H  3.289757 2.199747 -0.656187
H  2.101927 -1.442507 -1.716031
H  3.613453 -0.759082 -2.226696
H  5.236424 0.275883 0.732396
H  5.413554 2.021172 0.589221
H  4.105888 1.352503 1.558184
H  3.251437 -2.373599 0.35495
H  3.909724 -3.001928 -1.153225
H  4.788569 -1.763272 -0.264075
H  -0.238878 0.256665 2.053235
H  -1.159745 -1.22327 1.801518
H  -0.990245 2.315312 1.157033
H  -4.478511 -0.005153 -1.444339
H  -2.707907 3.627413 -0.0286
H  -4.464917 2.464262 -1.335866
totalener: -1455.38160788 hartree
nucrepener: 1345.76220996 hartree
electener: -2801.14381784 hartree
oneelecener: -4670.29681681 hartree
twoeener: 1869.15299897 hartree
kineticenergy: 1451.37519137 hartree
xcener: -99.510640082392 hartree
chargesum: 0.0000000
charge: -0.080131 -0.104353 -0.440084 -0.141989 -0.025130 -0.070673 0.315665 -0.248450 -0.232076 -0.130329 0.027152 0.000359 -0.108488 -0.124406 -0.124021 -0.131239 0.073509 0.094430 0.096697 0.081458 0.071030 0.086169 0.100569 0.085959 0.087165 0.078802 0.124393 0.142501 0.126917 0.116638 0.126575 0.125383
qa: -0.0801 -0.1044 -0.4401 -0.1420 -0.0251 -0.0707 0.3157 -0.2485 -0.2321 -0.1303 0.0272 0.0004 -0.1085 -0.1244 -0.1240 -0.1312 0.0735 0.0944 0.0967 0.0815 0.0710 0.0862 0.1006 0.0860 0.0872 0.0788 0.1244 0.1425 0.1269 0.1166 0.1266 0.1254
va: 1.2523 2.3229 2.0563 3.1775 3.8843 3.9115 4.2434 3.9069 3.8911 3.8541 3.5613 4.0089 3.9337 4.0042 3.9698 3.9673 1.0026 1.0128 1.0142 1.0027 1.0051 1.0104 1.0131 1.0205 1.0135 1.0029 1.0374 1.0066 1.0217 1.0132 1.0004 0.9992
dispcorr: -0.014199750 hartree
energy: -1455.395807627586
dipole: 27.85061 -27.14338 0.70723 7.26740 -7.17024 0.09717 -0.74610 0.24395 -0.50215
magnitude: 0.87280 au
magnitude: 2.21847 debye
