program: Orca
programVersion: 5.0.2
elementType: S O N C C C C C C C C C H H H H H H H H H H H H H H H H H
charge: 0
multiplicity: 1
keywords: wb97x-d3
keywords: def2-TZVPP
keywords: def2/J RIJCOSX
keywords: DEFGRID2
keywords: scfconv7
keywords: smallprint printgap noloewdin
keywords: NOSOSCF
formula: C9H17NOS
InChI: InChI=1/C9H17NOS/c1-2-12-9(11)10-7-5-3-4-6-8-10/h2-8H2,1H3
29 atoms
S  1.654003 -0.92596 -0.171011
O  0.891038 1.598271 -0.208482
N  -0.519818 0.195053 0.864539
C  -2.985356 -0.956881 -0.42361
C  -2.584133 0.326007 -1.157711
C  -1.80026 -1.79231 0.055978
C  -2.309293 1.542913 -0.273742
C  -0.971481 -1.157866 1.162747
C  -1.524211 1.244703 1.003162
C  0.593356 0.474034 0.166979
C  3.102212 -0.088145 -0.870028
C  4.003978 0.533685 0.177304
H  -3.652781 -0.727477 0.413604
H  -3.567839 -1.579081 -1.106309
H  -1.705234 0.114102 -1.774933
H  -3.373105 0.601214 -1.860837
H  -1.156374 -2.015058 -0.800108
H  -2.156464 -2.754996 0.431563
H  -3.254528 1.996967 0.033608
H  -1.791355 2.297863 -0.868065
H  -1.560095 -1.09732 2.079106
H  -0.115905 -1.788878 1.407616
H  -1.057784 2.153501 1.383044
H  -2.204544 0.906432 1.783093
H  3.627918 -0.873512 -1.412942
H  2.769924 0.63877 -1.608846
H  4.37534 -0.217698 0.87315
H  4.865432 0.998578 -0.304534
H  3.489072 1.302905 0.75074
elementType: S O N C H
totalener: -881.46159822 hartree
nucrepener: 879.22278571 hartree
electener: -1760.68438394 hartree
oneelecener: -2951.53722741 hartree
twoeener: 1190.85284347 hartree
cpcmener: -0.01958195 hartree
kineticenergy: 878.49839038 hartree
xcener: -67.427113509850 hartree
chargesum: -0.0000000
charge: -0.116833 -0.552001 -0.108641 -0.117819 -0.147732 -0.132668 -0.156282 -0.089006 -0.082231 0.308518 -0.065290 -0.262274 0.071254 0.083333 0.071049 0.087719 0.068331 0.077186 0.084104 0.082061 0.108856 0.103142 0.105591 0.107347 0.112531 0.092374 0.084847 0.095566 0.086968
qa: -0.1168 -0.5520 -0.1086 -0.1178 -0.1477 -0.1327 -0.1563 -0.0890 -0.0822 0.3085 -0.0653 -0.2623 0.0713 0.0833 0.0710 0.0877 0.0683 0.0772 0.0841 0.0821 0.1089 0.1031 0.1056 0.1073 0.1125 0.0924 0.0848 0.0956 0.0870
va: 2.3547 1.9410 3.1420 3.8350 3.8912 3.8903 3.8220 3.8927 3.8638 4.2792 3.8840 3.9299 1.0105 1.0048 1.0101 1.0044 1.0194 1.0197 1.0132 1.0193 0.9982 1.0159 1.0131 1.0018 1.0067 1.0310 1.0074 1.0042 1.0124
dispcorr: -0.012468312 hartree
energy: -881.474066535383
dipole: -6.08305 5.18807 -0.89498 0.00308 -1.10019 -1.09712 -0.60633 1.06450 0.45817
magnitude: 1.48814 au
magnitude: 3.78256 debye
