program: Orca
programVersion: 5.0.2
elementType: S O N C C C C C C C C C H H H H H H H H H H H H H H H H H
charge: 0
multiplicity: 1
keywords: wb97x-d3
keywords: def2-TZVPP
keywords: def2/J RIJCOSX
keywords: DEFGRID2
keywords: scfconv7
keywords: smallprint printgap noloewdin
keywords: NOSOSCF
formula: C9H17NOS
InChI: InChI=1/C9H17NOS/c1-2-12-9(11)10-7-5-3-4-6-8-10/h2-8H2,1H3
29 atoms
S  1.732121 1.251429 0.007343
O  1.284884 -1.194983 -0.862947
N  -0.550487 0.124581 -0.758106
C  -2.968573 -1.355449 0.654408
C  -2.65147 -0.009174 1.301104
C  -1.87992 -1.917009 -0.251143
C  -2.572001 1.141212 0.29721
C  -1.381295 -0.941184 -1.310085
C  -1.197858 1.356646 -0.324638
C  0.757716 -0.127008 -0.587343
C  3.369767 0.483913 0.137243
C  3.561492 -0.344811 1.390465
H  -3.18544 -2.088988 1.434933
H  -3.891589 -1.245638 0.075528
H  -3.442088 0.213924 2.020891
H  -1.724144 -0.071671 1.880578
H  -2.266199 -2.802571 -0.762288
H  -1.030381 -2.256673 0.346863
H  -2.826563 2.083848 0.786536
H  -3.327891 1.000462 -0.479728
H  -0.81019 -1.470364 -2.070861
H  -2.219217 -0.475033 -1.831043
H  -1.280512 2.05535 -1.161847
H  -0.56958 1.834429 0.426636
H  3.565362 -0.088713 -0.767054
H  4.056459 1.33155 0.130877
H  3.428524 0.259158 2.287374
H  2.8648 -1.180286 1.436017
H  4.573251 -0.753086 1.41007
elementType: S O N C H
totalener: -881.46114058 hartree
nucrepener: 869.27235675 hartree
electener: -1750.73349734 hartree
oneelecener: -2931.54798207 hartree
twoeener: 1180.81448473 hartree
cpcmener: -0.01958009 hartree
kineticenergy: 878.49477448 hartree
xcener: -67.427474640343 hartree
chargesum: 0.0000000
charge: -0.127218 -0.559042 -0.094766 -0.126682 -0.146419 -0.139196 -0.098762 -0.069570 -0.133337 0.320595 -0.064214 -0.265298 0.072500 0.063906 0.085063 0.067323 0.079508 0.073402 0.083615 0.079987 0.096862 0.107904 0.109021 0.109813 0.092918 0.113603 0.085296 0.087116 0.096074
qa: -0.1272 -0.5590 -0.0948 -0.1267 -0.1464 -0.1392 -0.0988 -0.0696 -0.1333 0.3206 -0.0642 -0.2653 0.0725 0.0639 0.0851 0.0673 0.0795 0.0734 0.0836 0.0800 0.0969 0.1079 0.1090 0.1098 0.0929 0.1136 0.0853 0.0871 0.0961
va: 2.3543 1.9280 3.1611 3.9055 3.9029 3.8786 3.8167 3.8424 3.9260 4.2548 3.8826 3.9335 1.0101 1.0096 1.0035 1.0133 1.0137 1.0184 1.0097 1.0100 1.0252 1.0021 0.9987 1.0059 1.0307 1.0063 1.0067 1.0131 1.0036
dispcorr: -0.011915547 hartree
energy: -881.473056129490
dipole: -7.67312 6.49477 -1.17835 -3.35313 4.24797 0.89484 5.10658 -4.73604 0.37054
magnitude: 1.52530 au
magnitude: 3.87701 debye
