program: Gaussian 09
title: 000056056
version: EM64L-G09RevD.01
frameworkgroup: C1[X(C6H5N3O3S)]
method: RPBEPBE
basis: SDD
operation: Freq
keyword: #p
keyword: freq=noraman
keyword: PBEPBE/SDD
title: #p freq=noraman PBEPBE/SDD
converged: NO NO NO NO
title: Mulliken charges:
elementType: S O O O N N N C C C C C C H H H H H
charge: 0.222184 -0.169255 -0.412003 -0.240743 -0.375511 -0.008730 0.001499 -0.101878 0.258527 -0.294057 -0.201865 -0.400599 0.175624 0.334108 0.247438 0.293836 0.284564 0.386861
chargesum: 0.00000
title: Mulliken charges with hydrogens summed into heavy atoms:
elementType: S O O O N N N C C C C C C
charge: 0.222184 -0.169255 -0.025143 -0.240743 -0.041403 -0.008730 0.001499 -0.101878 0.258527 -0.046619 0.091971 -0.116035 0.175624
polarizability: 2.28946154e+02 8.67931811e+00 1.13102232e+02 -5.40948496e-03 4.54692923e-03 4.33584131e+01
1716.lowfreq: -0.0010 0.0008 0.0018 3.9785 6.2982 15.1866 20.3572 38.4463 64.1362
frequency: 19.1571 38.1078 64.1347 68.7679 152.0140 152.2009 177.4714 221.1797 279.2524 288.0000 294.5690 471.4366 534.1541 548.1253 568.7110 574.1130 581.5778 589.5780 601.9971 653.9090 682.4307 731.3531 759.2243 797.0863 821.7647 888.2253 911.6387 935.9713 984.5256 998.4350 1055.7216 1095.8823 1135.8356 1185.4749 1218.2747 1305.6433 1328.9232 1369.3453 1471.7798 1495.3988 1626.0246 1629.0912 1664.0535 3110.3836 3169.8787 3238.8018 3518.1345 3544.5044
redmass: 11.9047 7.5685 8.8141 7.4078 9.3501 4.6697 2.8916 10.9646 10.2560 4.2347 10.6612 5.1578 6.5620 12.7484 2.5344 8.1327 2.1572 6.5971 1.5473 1.9515 7.0990 8.7347 1.2295 7.2973 6.8418 8.9656 2.1770 4.0270 5.4217 1.0907 2.5366 3.6403 2.6630 1.2424 1.3969 1.5328 2.4582 8.7294 1.9542 4.9250 6.9263 8.3277 6.1744 1.0924 1.0930 1.0964 1.0642 1.0774
irintensity: 0.2337 0.8522 2.4353 6.5329 1.4655 0.7029 2.9102 0.8395 0.6950 7.4850 3.0407 65.5534 0.1689 40.5743 64.5976 30.0024 9.3350 6.6845 109.0302 63.7675 12.1970 46.7893 36.4132 3.5028 11.4906 10.6862 4.7790 13.2750 35.6474 63.8964 339.4948 75.1349 120.7466 0.5584 71.1150 86.7852 225.2342 19.3334 567.0332 91.8024 221.1571 83.9226 24.3920 2.5908 1.8364 3.9365 64.4961 31.2272
temp: 298.150 k
press: 1.00000 atm
elementType: 16 8 8 8 7 7 7 6 6 6 6 6 6 1 1 1 1 1
symmnumber: 1
zpe: 296388.4 jmol-1
zpe.correction: 0.112888 hartree
zpe.thermalcorrener: 0.125268 hartree
zpe.thermalcorrenthalpy: 0.126212 hartree
zpe.thermalcorrgfe: 0.071323 hartree
zpe.sumelectzpe: -1018.632838 hartree
zpe.sumelectthermal: -1018.620458 hartree
zpe.sumelectthermalent: -1018.619514 hartree
zpe.sumelectthermalfe: -1018.674403 hartree
dipole: -0.8273 4.8689 0.0002
dipole: 4.9387
quadrupole: -63.0521 -94.5513 -82.3356
quadrupole: 14.3494 -0.0021 -0.0004
quadrupole: 16.9275 -14.5716 -2.3559 14.3494 -0.0021 -0.0004
hfenergy: -1018.7457261 hartree
pointgroup: C01 [X(C6H5N3O3S1)]
dipole: 0.4375889 -1.8931322 -0.000296 debye
dipolederiv: -0.3571831 0.0870581 -0.0000917 -0.163975 -0.6048397 -0.000228 -0.0002174 -0.000197 0.1334888 -0.5969309 0.0233315 0.0000621 -0.4012548 -0.7878425 -0.0003745 0.0002587 0.0001955 -0.29885 -1.1893117 -0.5885259 0.0000079 -0.5390198 -0.6218773 0.0000049 -0.0005066 -0.000492 -0.4270271 -0.848532 0.1336568 0.0000364 0.1997013 -0.8901857 -0.000419 -0.0000607 0.000425 -0.3266171 -2.0123908 -0.3965939 -0.0002214 -0.5033465 -0.4972266 -0.0000393 -0.000266 -0.0000489 -0.3284369 -0.2959143 -0.1362205 -0.0000913 0.2612122 -0.4519381 -0.0000198 -0.000011 -0.0001467 -0.1270071 -0.1121773 0.1608942 0.0000861 -0.0689487 -0.3840501 -0.000061 -0.0000214 -0.0000151 -0.1374852 1.538303 0.3003995 0.0003967 0.0645445 0.6941185 0.0001988 0.0005224 0.0002868 0.0538223 1.8412136 0.2797292 -0.0000198 0.9144078 1.1265906 0.0004407 -0.0006429 -0.0000887 0.2857469 -0.1851087 0.0418858 -0.0000602 0.1035979 0.052484 0.0000459 0.0004009 0.0000494 -0.1528396 -0.745634 -0.0018318 -0.0000476 0.1349563 0.0516776 0.0000526 0.000525 -0.0000371 -0.0719005 0.0323764 -0.2797476 -0.0000075 -0.2185942 0.6405268 0.0001317 0.000039 0.0001452 -0.158914 2.1798962 0.2906994 0.0000499 -0.036381 1.2311539 0.000368 -0.0001153 0.0000841 0.2518239 0.1881991 -0.0360099 -0.0000652 0.0154421 0.151966 -0.0000483 -0.0001655 -0.0001002 0.3364555 0.0621956 -0.0077338 0.00004 0.009855 -0.0430257 -0.0000216 0.0001615 -0.0000491 0.1737615 0.1222507 0.0291791 0.0000359 0.0530851 0.0430468 -0.0000082 0.0002163 -0.0000299 0.1749212 0.0613602 -0.015569 -0.0000419 0.0141325 0.0882059 -0.0000324 -0.0000495 -0.0000365 0.2113372 0.317388 0.1153988 -0.0000684 0.1605855 0.2012155 0.0000095 -0.0000675 0.0000552 0.4077203 unknown
polarizability: 227.5264154|15.420208|114.5219685|0.0157205|0.0104971|43.3584151 unknown
InChI: InChI=1S/C6H5N3O3S/c10-4(1-2-5(11)12)8-6-9-7-3-13-6/h1-3,8,11H
charge 0 multiplicity 1
18 atoms
S  -3.384938 -1.738868 -0.000481
O  0.057851 1.625002 0.000571
O  5.06945 0.73629 0.000357
O  4.255368 -1.447602 0.000289
N  -0.832038 -0.570139 0.000568
N  -2.776914 0.893608 0.000366
N  -4.18198 0.814841 -0.000042
C  -2.197893 -0.308249 0.000242
C  0.229885 0.382006 0.000988
C  1.569498 -0.280985 0.000402
C  2.713999 0.455481 0.000024
C  -4.649648 -0.424612 -0.000421
C  4.038826 -0.210329 -0.000597
H  -0.556219 -1.554472 0.000418
H  1.647559 -1.3774 0.00025
H  2.677909 1.549648 0.000162
H  -5.711113 -0.668075 -0.000759
H  5.949796 0.270455 0.000862
