program: Orca
programVersion: 5.0.2
elementType: S O N C C C C C C C C C H H H H H H H H H H H H H H H H H
charge: 0
multiplicity: 1
keywords: wb97x-d3
keywords: def2-TZVPP
keywords: def2/J RIJCOSX
keywords: DEFGRID2
keywords: scfconv7
keywords: smallprint printgap noloewdin
keywords: NOSOSCF
formula: C9H17NOS
InChI: InChI=1/C9H17NOS/c1-2-12-9(11)10-7-5-3-4-6-8-10/h2-8H2,1H3
29 atoms
S  1.677275 -0.885984 0.160869
O  1.12301 1.665361 0.528125
N  -0.532064 0.466718 -0.445378
C  -3.18812 -1.214916 0.253064
C  -3.353412 0.241041 0.675403
C  -1.7554 -1.661222 0.001597
C  -2.916099 1.252361 -0.384476
C  -1.007934 -0.790525 -1.001272
C  -1.439986 1.614111 -0.370802
C  0.692195 0.608704 0.088852
C  3.27167 -0.225528 0.717109
C  4.071585 0.438968 -0.384359
H  -3.629907 -1.862244 1.014338
H  -3.771563 -1.377603 -0.658942
H  -4.409812 0.408354 0.896042
H  -2.818297 0.429335 1.611862
H  -1.765724 -2.685555 -0.378741
H  -1.193259 -1.687919 0.939205
H  -3.439857 2.197078 -0.222046
H  -3.229413 0.912815 -1.375037
H  -0.160221 -1.333076 -1.418744
H  -1.642497 -0.564892 -1.859563
H  -1.231742 2.306544 -1.190771
H  -1.232721 2.150283 0.554659
H  3.10936 0.438865 1.564223
H  3.79831 -1.101613 1.097824
H  5.044161 0.748162 0.001757
H  4.244456 -0.244394 -1.2150
H  3.570792 1.324911 -0.770986
elementType: S O N C H
totalener: -881.46095468 hartree
nucrepener: 865.85986040 hartree
electener: -1747.32081507 hartree
oneelecener: -2924.66085680 hartree
twoeener: 1177.34004173 hartree
cpcmener: -0.01987634 hartree
kineticenergy: 878.49760775 hartree
xcener: -67.428182110640 hartree
chargesum: 0.0000000
charge: -0.126501 -0.556753 -0.106022 -0.112429 -0.141992 -0.147274 -0.112247 -0.089409 -0.086267 0.323212 -0.065570 -0.261757 0.071784 0.063862 0.084593 0.065994 0.080030 0.068296 0.083426 0.074460 0.110505 0.113227 0.103536 0.092107 0.091896 0.112582 0.096104 0.083858 0.086748
qa: -0.1265 -0.5568 -0.1060 -0.1124 -0.1420 -0.1473 -0.1122 -0.0894 -0.0863 0.3232 -0.0656 -0.2618 0.0718 0.0639 0.0846 0.0660 0.0800 0.0683 0.0834 0.0745 0.1105 0.1132 0.1035 0.0921 0.0919 0.1126 0.0961 0.0839 0.0867
va: 2.3474 1.9385 3.1557 3.9029 3.8977 3.8779 3.8838 3.8378 3.8924 4.2417 3.8892 3.9277 1.0104 1.0105 1.0031 1.0114 1.0136 1.0219 1.0083 1.0112 1.0253 1.0021 1.0002 1.0091 1.0302 1.0059 1.0039 1.0074 1.0128
dispcorr: -0.011738694 hartree
energy: -881.472693373611
dipole: -7.22091 6.16516 -1.05575 -0.57218 -0.38904 -0.96122 -1.41433 0.78051 -0.63382
magnitude: 1.56214 au
magnitude: 3.97063 debye
