program: Orca
programVersion: 5.0.2
elementType: S O N C C C C C C C C C H H H H H H H H H H H H H H H H H
charge: 0
multiplicity: 1
keywords: wb97x-d3
keywords: def2-TZVPP
keywords: def2/J RIJCOSX
keywords: DEFGRID2
keywords: scfconv7
keywords: smallprint printgap noloewdin
keywords: NOSOSCF
formula: C9H17NOS
InChI: InChI=1/C9H17NOS/c1-2-12-9(11)10-7-5-3-4-6-8-10/h2-8H2,1H3
29 atoms
S  1.6767 -0.928727 0.027649
O  1.123629 1.598572 0.510185
N  -0.505128 0.456429 -0.586393
C  -2.951469 -1.214268 0.514013
C  -2.961809 0.237174 0.987621
C  -1.62442 -1.706977 -0.047031
C  -2.843385 1.240847 -0.158978
C  -1.008763 -0.805458 -1.111386
C  -1.416754 1.597437 -0.563983
C  0.693533 0.568382 0.011556
C  3.239346 -0.307442 0.704068
C  4.101193 0.411272 -0.313858
H  -3.237357 -1.867491 1.342123
H  -3.730657 -1.330247 -0.246099
H  -3.904741 0.4150 1.508982
H  -2.172473 0.405743 1.728144
H  -1.768071 -2.696274 -0.488822
H  -0.90576 -1.839098 0.766069
H  -3.324076 2.182598 0.114859
H  -3.402213 0.865687 -1.020346
H  -0.203152 -1.327321 -1.630855
H  -1.740888 -0.571004 -1.885801
H  -1.425387 2.07661 -1.546758
H  -1.021186 2.327461 0.136955
H  3.030384 0.311635 1.575641
H  3.743734 -1.204064 1.067065
H  4.355111 -0.241556 -1.148175
H  3.607632 1.296334 -0.712373
H  5.032838 0.732791 0.154608
elementType: S O N C H
totalener: -881.46040659 hartree
nucrepener: 871.79905967 hartree
electener: -1753.25946626 hartree
oneelecener: -2936.57926781 hartree
twoeener: 1183.31980156 hartree
cpcmener: -0.01915531 hartree
kineticenergy: 878.49601734 hartree
xcener: -67.428488273098 hartree
chargesum: 0.0000000
charge: -0.123570 -0.555353 -0.107950 -0.119708 -0.147177 -0.149877 -0.103597 -0.080452 -0.101725 0.319923 -0.066227 -0.261904 0.073615 0.065836 0.085766 0.068669 0.080053 0.071719 0.083891 0.075906 0.107436 0.109523 0.106413 0.097953 0.091654 0.112645 0.084995 0.085845 0.095699
qa: -0.1236 -0.5554 -0.1080 -0.1197 -0.1472 -0.1499 -0.1036 -0.0805 -0.1017 0.3199 -0.0662 -0.2619 0.0736 0.0658 0.0858 0.0687 0.0801 0.0717 0.0839 0.0759 0.1074 0.1095 0.1064 0.0980 0.0917 0.1126 0.0850 0.0858 0.0957
va: 2.3531 1.9402 3.1511 3.8948 3.9015 3.8615 3.8329 3.8461 3.8710 4.2469 3.8848 3.9294 1.0101 1.0097 1.0036 1.0124 1.0165 1.0293 1.0091 1.0106 1.0195 0.9998 0.9996 1.0267 1.0312 1.0064 1.0067 1.0132 1.0039
dispcorr: -0.011894182 hartree
energy: -881.472300771832
dipole: -6.68206 5.65237 -1.02968 -0.54992 -0.38812 -0.93804 -0.33283 -0.27740 -0.61023
magnitude: 1.52070 au
magnitude: 3.86532 debye
