program: Orca
programVersion: 5.0.2
elementType: S O N C C C C C C C C C H H H H H H H H H H H H H H H H H
charge: 0
multiplicity: 1
keywords: wb97x-d3
keywords: def2-TZVPP
keywords: def2/J RIJCOSX
keywords: DEFGRID2
keywords: scfconv7
keywords: smallprint printgap noloewdin
keywords: NOSOSCF
formula: C9H17NOS
InChI: InChI=1/C9H17NOS/c1-2-12-9(11)10-7-5-3-4-6-8-10/h2-8H2,1H3
29 atoms
S  1.677663 -0.923632 -0.153658
O  0.913321 1.60033 -0.19058
N  -0.526673 0.189462 0.830507
C  -3.005829 -0.959505 -0.417015
C  -2.610699 0.322717 -1.156363
C  -1.818923 -1.797541 0.055432
C  -2.322952 1.541875 -0.278719
C  -0.971836 -1.158807 1.147122
C  -1.520562 1.243421 0.988247
C  0.607188 0.477464 0.169598
C  3.120864 -0.079754 -0.856548
C  4.032246 0.535004 0.186641
H  -3.669318 -0.729965 0.423654
H  -3.593461 -1.582424 -1.095333
H  -1.739837 0.108699 -1.784112
H  -3.407549 0.597658 -1.851285
H  -1.185722 -2.029487 -0.806353
H  -2.176624 -2.756549 0.440249
H  -3.263602 2.000818 0.037139
H  -1.808187 2.293025 -0.881167
H  -1.546051 -1.093857 2.073224
H  -0.113527 -1.790831 1.380333
H  -1.04231 2.150739 1.357492
H  -2.191423 0.910012 1.77941
H  3.642762 -0.859148 -1.412736
H  2.779977 0.655133 -1.584104
H  4.411095 -0.219789 0.875462
H  4.889745 1.003444 -0.300003
H  3.521958 1.301314 0.76851
elementType: S O N C H
totalener: -881.46851606 hartree
nucrepener: 877.50373365 hartree
electener: -1758.97224971 hartree
oneelecener: -2948.01134149 hartree
twoeener: 1189.03909179 hartree
cpcmener: -0.01528329 hartree
kineticenergy: 878.48936542 hartree
xcener: -67.423904978901 hartree
chargesum: -0.0000000
charge: -0.123917 -0.517231 -0.106207 -0.116944 -0.149726 -0.128297 -0.152335 -0.096509 -0.084327 0.295643 -0.065995 -0.262214 0.069747 0.083057 0.071488 0.086615 0.067412 0.075292 0.081916 0.083161 0.107018 0.102544 0.104406 0.105569 0.110368 0.093599 0.083547 0.093614 0.088705
qa: -0.1239 -0.5172 -0.1062 -0.1169 -0.1497 -0.1283 -0.1523 -0.0965 -0.0843 0.2956 -0.0660 -0.2622 0.0697 0.0831 0.0715 0.0866 0.0674 0.0753 0.0819 0.0832 0.1070 0.1025 0.1044 0.1056 0.1104 0.0936 0.0835 0.0936 0.0887
va: 2.3467 1.9851 3.1349 3.8329 3.8973 3.8909 3.8220 3.8995 3.8669 4.2992 3.8853 3.9297 1.0104 1.0050 1.0096 1.0045 1.0190 1.0198 1.0132 1.0183 0.9981 1.0165 1.0149 1.0011 1.0067 1.0312 1.0075 1.0044 1.0124
dispcorr: -0.012402592 hartree
energy: -881.480918650198
dipole: -6.17476 5.31390 -0.86086 0.00392 -0.97790 -0.97398 -0.63394 1.04419 0.41025
magnitude: 1.36309 au
magnitude: 3.46470 debye
