program: Orca
programVersion: 5.0.2
elementType: Cl O O N C C C C C C C C C C C C C C C H H H H H H H H H H H H H H H H H H H H H H
charge: 0
multiplicity: 1
keywords: wb97x-d3
keywords: def2-TZVPP
keywords: def2/J RIJCOSX
keywords: DEFGRID2
keywords: scfconv7
keywords: smallprint printgap noloewdin
keywords: NOSOSCF
formula: C15H22ClNO2
InChI: InChI=1/C15H22ClNO2/c1-5-13-8-6-7-11(2)15(13)17(14(18)9-16)12(3)10-19-4/h6-8,12H,5,9-10H2,1-4H3
41 atoms
Cl 1.765836 2.048679 2.177499
O  -2.089435 -0.702744 -2.105026
O  -0.823081 3.011425 0.356687
N  -0.526631 0.797666 -0.006872
C  -1.995972 0.605297 -0.079314
C  0.377492 -0.263151 -0.326665
C  0.716746 -1.222004 0.631303
C  -2.393493 -0.704733 -0.73357
C  0.910729 -0.307553 -1.625252
C  -2.653383 0.67403 1.297108
C  0.230278 -1.186267 2.055531
C  -0.078088 2.046009 0.237139
C  1.570488 -2.259101 0.25284
C  1.750415 -1.361726 -1.961962
C  0.664656 0.783781 -2.624663
C  2.073295 -2.339156 -1.031875
C  -0.679084 -2.358321 2.410976
C  1.4145 2.243954 0.428463
C  -2.163092 -1.987158 -2.676076
H  -2.392864 1.417338 -0.693863
H  -1.914081 -1.550661 -0.225264
H  -3.474582 -0.826793 -0.581985
H  -2.48703 -0.238255 1.869604
H  -3.730189 0.79576 1.178206
H  -2.294328 1.513557 1.888175
H  1.103491 -1.210057 2.711934
H  -0.275651 -0.246475 2.267541
H  1.846583 -3.007816 0.985757
H  2.161704 -1.411922 -2.962708
H  1.323341 1.636878 -2.438949
H  0.881671 0.433874 -3.633243
H  -0.35528 1.159669 -2.614051
H  2.73034 -3.153604 -1.308519
H  -1.00817 -2.285034 3.447899
H  -0.165207 -3.313312 2.296095
H  -1.569367 -2.386006 1.782194
H  2.051867 1.549438 -0.108515
H  1.676099 3.261765 0.15121
H  -3.169432 -2.415227 -2.601181
H  -1.462171 -2.684898 -2.203281
H  -1.90449 -1.90191 -3.730907
elementType: Cl O N C H
totalener: -1250.34549640 hartree
nucrepener: 1747.89303432 hartree
electener: -2998.23853073 hartree
oneelecener: -5183.57461270 hartree
twoeener: 2185.33608198 hartree
cpcmener: -0.03132272 hartree
kineticenergy: 1246.02318390 hartree
xcener: -99.067071958371 hartree
chargesum: 0.0000000
charge: -0.160800 -0.380886 -0.539657 0.039127 0.130134 0.129661 -0.113945 -0.030749 -0.233333 -0.326908 -0.180192 0.331061 -0.070674 -0.068648 -0.279796 -0.202147 -0.281978 -0.078865 -0.120986 0.072055 0.101830 0.113293 0.107649 0.111355 0.101037 0.097325 0.071517 0.143400 0.139205 0.112568 0.108623 0.102988 0.157895 0.103972 0.092687 0.081802 0.148375 0.153128 0.108953 0.089851 0.120072
qa: -0.1608 -0.3809 -0.5397 0.0391 0.1301 0.1297 -0.1139 -0.0307 -0.2333 -0.3269 -0.1802 0.3311 -0.0707 -0.0686 -0.2798 -0.2021 -0.2820 -0.0789 -0.1210 0.0721 0.1018 0.1133 0.1076 0.1114 0.1010 0.0973 0.0715 0.1434 0.1392 0.1126 0.1086 0.1030 0.1579 0.1040 0.0927 0.0818 0.1484 0.1531 0.1090 0.0899 0.1201
va: 1.1143 1.9257 1.9591 2.9849 3.6836 3.4703 3.7260 3.9999 3.8637 3.9471 3.8736 4.0734 3.7856 3.7920 3.9481 3.9698 3.9161 3.9547 3.8956 1.0378 0.9870 0.9991 0.9883 1.0070 1.0137 1.0048 1.0197 0.9967 1.0003 0.9916 1.0015 1.0128 0.9906 1.0017 1.0059 1.0049 1.0078 1.0075 0.9928 0.9892 0.9911
dispcorr: -0.026322481 hartree
energy: -1250.371818882229
dipole: -13.60181 13.85638 0.25457 -17.61251 15.07727 -2.53524 -7.16394 6.33448 -0.82946
magnitude: 2.67960 au
magnitude: 6.81100 debye
