program: Orca
programVersion: 5.0.2
elementType: Cl O O N C C C C C C C C C C C C C C C H H H H H H H H H H H H H H H H H H H H H H
charge: 0
multiplicity: 1
keywords: wb97x-d3
keywords: def2-TZVPP
keywords: def2/J RIJCOSX
keywords: DEFGRID2
keywords: scfconv7
keywords: smallprint printgap noloewdin
keywords: NOSOSCF
formula: C15H22ClNO2
InChI: InChI=1/C15H22ClNO2/c1-5-13-8-6-7-11(2)15(13)17(14(18)9-16)12(3)10-19-4/h6-8,12H,5,9-10H2,1-4H3
41 atoms
Cl 2.051917 2.475206 0.947939
O  -2.67401 -1.365691 -0.75117
O  -1.333148 2.230304 1.033612
N  -0.43223 0.577432 -0.227988
C  -1.484151 0.646511 -1.264978
C  0.555861 -0.447462 -0.360564
C  0.526321 -1.574939 0.473281
C  -2.80155 0.034868 -0.81233
C  1.526989 -0.307955 -1.363199
C  -1.711073 2.040173 -1.842738
C  -0.492182 -1.783932 1.568956
C  -0.427833 1.437696 0.811659
C  1.495781 -2.558124 0.279518
C  2.474525 -1.313265 -1.518045
C  1.559153 0.876728 -2.281035
C  2.460434 -2.433729 -0.703931
C  0.125933 -2.052146 2.938339
C  0.792934 1.453187 1.716571
C  -3.789788 -1.983097 -0.155033
H  -1.110135 0.023903 -2.079529
H  -3.106846 0.447739 0.156783
H  -3.580478 0.313555 -1.535541
H  -2.188119 1.933373 -2.817116
H  -0.773193 2.571901 -1.995284
H  -2.358669 2.660062 -1.227198
H  -1.168638 -0.934455 1.647055
H  -1.119055 -2.637393 1.297971
H  1.488795 -3.440728 0.907152
H  3.23253 -1.210478 -2.284807
H  2.533412 0.960284 -2.760657
H  0.816716 0.785393 -3.077019
H  1.362212 1.812203 -1.760942
H  3.20323 -3.209714 -0.835902
H  0.768741 -1.232482 3.261504
H  0.721834 -2.96448 2.948711
H  -0.658424 -2.169155 3.686384
H  0.525054 1.917644 2.661676
H  1.240283 0.484251 1.908607
H  -4.716408 -1.76977 -0.700552
H  -3.929215 -1.665576 0.88457
H  -3.62693 -3.060275 -0.16766
elementType: Cl O N C H
totalener: -1250.34539928 hartree
nucrepener: 1730.53225988 hartree
electener: -2980.87765916 hartree
oneelecener: -5149.26001834 hartree
twoeener: 2168.38235918 hartree
cpcmener: -0.03061901 hartree
kineticenergy: 1246.01744577 hartree
xcener: -99.064324854827 hartree
chargesum: 0.0000000
charge: -0.161405 -0.380532 -0.531176 0.052912 0.147603 0.114562 -0.185888 -0.043794 -0.153417 -0.308613 -0.171139 0.307796 -0.086193 -0.071101 -0.294515 -0.201184 -0.256810 -0.072890 -0.139361 0.084548 0.096000 0.104670 0.108008 0.108478 0.099225 0.090406 0.095729 0.147281 0.139572 0.107789 0.109850 0.095645 0.157674 0.080437 0.087907 0.096151 0.152788 0.145754 0.106678 0.100118 0.120439
qa: -0.1614 -0.3805 -0.5312 0.0529 0.1476 0.1146 -0.1859 -0.0438 -0.1534 -0.3086 -0.1711 0.3078 -0.0862 -0.0711 -0.2945 -0.2012 -0.2568 -0.0729 -0.1394 0.0845 0.0960 0.1047 0.1080 0.1085 0.0992 0.0904 0.0957 0.1473 0.1396 0.1078 0.1098 0.0956 0.1577 0.0804 0.0879 0.0962 0.1528 0.1458 0.1067 0.1001 0.1204
va: 1.1180 1.9122 1.9617 2.9537 3.6921 3.6683 3.7504 3.9610 3.8077 3.9201 3.9128 4.0831 3.8111 3.8035 3.9462 3.9673 3.9196 3.9739 3.9007 1.0191 1.0030 0.9990 1.0022 0.9983 1.0165 1.0000 0.9998 0.9947 1.0017 1.0050 0.9894 1.0152 0.9913 1.0066 1.0037 1.0043 1.0088 1.0193 0.9931 0.9891 0.9897
dispcorr: -0.024926766 hartree
energy: -1250.370326043370
dipole: -14.47505 14.29197 -0.18309 -13.28921 11.57672 -1.71249 -3.22872 2.88029 -0.34843
magnitude: 1.75714 au
magnitude: 4.46631 debye
