program: Orca
programVersion: 5.0.2
elementType: Cl O O N C C C C C C C C C C C C C C C H H H H H H H H H H H H H H H H H H H H H H
charge: 0
multiplicity: 1
keywords: wb97x-d3
keywords: def2-TZVPP
keywords: def2/J RIJCOSX
keywords: DEFGRID2
keywords: scfconv7
keywords: smallprint printgap noloewdin
keywords: NOSOSCF
formula: C15H22ClNO2
InChI: InChI=1/C15H22ClNO2/c1-5-13-8-6-7-11(2)15(13)17(14(18)9-16)12(3)10-19-4/h6-8,12H,5,9-10H2,1-4H3
41 atoms
Cl 1.974187 3.177395 1.568576
O  -2.006122 -0.726452 -2.302027
O  -0.727821 2.734465 0.683573
N  -0.608056 0.566727 0.048787
C  -2.063136 0.532251 -0.236232
C  0.247887 -0.51465 -0.32778
C  0.400447 -1.621047 0.509781
C  -2.483569 -0.722353 -0.981146
C  0.913024 -0.430472 -1.561624
C  -2.901955 0.606264 1.038917
C  -0.238857 -1.70157 1.870819
C  -0.083774 1.707163 0.549225
C  1.190865 -2.681366 0.063261
C  1.698419 -1.502012 -1.964058
C  0.829924 0.796183 -2.420312
C  1.825929 -2.628672 -1.163197
C  0.768117 -1.952186 2.989119
C  1.365821 1.604963 1.007989
C  -2.083092 -1.998014 -2.900706
H  -2.297914 1.396408 -0.864214
H  -2.150737 -1.61562 -0.435749
H  -3.581387 -0.749721 -0.974032
H  -2.89204 -0.341888 1.577036
H  -3.936873 0.826649 0.776655
H  -2.568129 1.384022 1.720748
H  -0.778512 -0.781911 2.088215
H  -0.985778 -2.500372 1.869723
H  1.306601 -3.558751 0.687699
H  2.211361 -1.455403 -2.916748
H  1.421528 1.615692 -2.003976
H  1.22728 0.593427 -3.413827
H  -0.187075 1.165302 -2.536178
H  2.429487 -3.462913 -1.49694
H  1.519227 -1.161744 3.026378
H  1.288645 -2.902412 2.870466
H  0.262527 -1.975168 3.954793
H  1.435066 0.900296 1.838172
H  2.032977 1.256612 0.223444
H  -1.676626 -1.920717 -3.908521
H  -3.115791 -2.358695 -2.972454
H  -1.501235 -2.745335 -2.348555
elementType: Cl O N C H
totalener: -1250.34541409 hartree
nucrepener: 1722.33696069 hartree
electener: -2972.68237477 hartree
oneelecener: -5132.14879461 hartree
twoeener: 2159.46641984 hartree
cpcmener: -0.03483185 hartree
kineticenergy: 1246.02344852 hartree
xcener: -99.068083466131 hartree
chargesum: 0.0000000
charge: -0.161531 -0.380297 -0.520772 0.008575 0.118625 0.206810 -0.137684 -0.031303 -0.299051 -0.325521 -0.204491 0.321341 -0.056822 -0.044064 -0.266806 -0.213122 -0.264107 -0.082845 -0.119485 0.075672 0.107846 0.113462 0.099487 0.108790 0.104050 0.092742 0.098995 0.143705 0.139296 0.106668 0.106078 0.103469 0.158501 0.084690 0.089122 0.094443 0.155815 0.153579 0.119196 0.109158 0.087784
qa: -0.1615 -0.3803 -0.5208 0.0086 0.1186 0.2068 -0.1377 -0.0313 -0.2991 -0.3255 -0.2045 0.3213 -0.0568 -0.0441 -0.2668 -0.2131 -0.2641 -0.0828 -0.1195 0.0757 0.1078 0.1135 0.0995 0.1088 0.1040 0.0927 0.0990 0.1437 0.1393 0.1067 0.1061 0.1035 0.1585 0.0847 0.0891 0.0944 0.1558 0.1536 0.1192 0.1092 0.0878
va: 1.1151 1.9195 1.9815 2.9772 3.6904 3.3233 3.7486 3.9875 3.9090 3.9440 3.8918 4.0916 3.7585 3.7563 3.9550 3.9707 3.9305 3.9804 3.8958 1.0325 0.9799 1.0000 0.9928 1.0065 1.0150 1.0014 0.9983 0.9974 0.9998 0.9903 1.0027 1.0117 0.9909 1.0014 1.0044 1.0045 1.0078 1.0006 0.9909 0.9930 0.9890
dispcorr: -0.025134734 hartree
energy: -1250.370548822131
dipole: -12.56161 12.35378 -0.20783 -22.03145 18.60282 -3.42863 -4.13035 3.70357 -0.42678
magnitude: 3.46133 au
magnitude: 8.79801 debye
