program: Orca
programVersion: 5.0.2
elementType: Cl O O N C C C C C C C C C C C C C C C H H H H H H H H H H H H H H H H H H H H H H
charge: 0
multiplicity: 1
keywords: wb97x-d3
keywords: def2-TZVPP
keywords: def2/J RIJCOSX
keywords: DEFGRID2
keywords: scfconv7
keywords: smallprint printgap noloewdin
keywords: NOSOSCF
formula: C15H22ClNO2
InChI: InChI=1/C15H22ClNO2/c1-5-13-8-6-7-11(2)15(13)17(14(18)9-16)12(3)10-19-4/h6-8,12H,5,9-10H2,1-4H3
41 atoms
Cl 2.036244 3.119168 1.886399
O  -2.230385 -1.541792 -1.147185
O  -0.62143 2.791103 0.815321
N  -0.472077 0.697265 -0.025892
C  -1.874679 0.75274 -0.497181
C  0.370719 -0.414244 -0.336985
C  0.492448 -1.477381 0.567827
C  -2.157308 -0.221949 -1.626822
C  1.078685 -0.40339 -1.545923
C  -2.872331 0.590606 0.64347
C  -0.172815 -1.48869 1.919511
C  0.032482 1.783911 0.597806
C  1.300588 -2.553592 0.214475
C  1.873534 -1.501892 -1.861776
C  1.050261 0.757567 -2.49781
C  1.978164 -2.57447 -0.993804
C  -1.156093 -2.639058 2.11165
C  1.49317 1.667397 1.016577
C  -2.097228 -2.507129 -2.160733
H  -2.016854 1.742678 -0.938375
H  -3.112597 0.077312 -2.07888
H  -1.404208 -0.130554 -2.417782
H  -2.789559 -0.378468 1.132769
H  -3.88782 0.684753 0.25489
H  -2.741927 1.360682 1.401352
H  0.609042 -1.56469 2.68024
H  -0.680825 -0.54343 2.105522
H  1.410318 -3.382513 0.903514
H  2.422811 -1.504827 -2.795638
H  0.770725 0.43211 -3.500399
H  0.361807 1.545922 -2.203195
H  2.042925 1.204715 -2.576816
H  2.603676 -3.419804 -1.249987
H  -1.591103 -2.603229 3.110751
H  -0.669629 -3.608702 2.001117
H  -1.972364 -2.592873 1.391649
H  1.645474 0.811477 1.67259
H  2.139698 1.542679 0.148929
H  -2.125707 -3.490551 -1.69266
H  -1.146607 -2.405609 -2.697141
H  -2.908353 -2.4521 -2.896005
elementType: Cl O N C H
totalener: -1250.34605168 hartree
nucrepener: 1728.23793353 hartree
electener: -2978.58398521 hartree
oneelecener: -5144.18567038 hartree
twoeener: 2165.60168517 hartree
cpcmener: -0.03451943 hartree
kineticenergy: 1246.02614528 hartree
xcener: -99.070275211839 hartree
chargesum: 0.0000000
charge: -0.158514 -0.378718 -0.526343 0.009164 0.129439 0.135015 -0.141163 -0.037399 -0.185368 -0.328881 -0.192497 0.323432 -0.077245 -0.101730 -0.305292 -0.183658 -0.270754 -0.074814 -0.118918 0.081890 0.121351 0.122343 0.099789 0.109318 0.102068 0.102197 0.090073 0.142431 0.139125 0.118706 0.098939 0.120357 0.158713 0.099445 0.092307 0.075326 0.149041 0.150034 0.111893 0.088758 0.110141
qa: -0.1585 -0.3787 -0.5263 0.0092 0.1294 0.1350 -0.1412 -0.0374 -0.1854 -0.3289 -0.1925 0.3234 -0.0772 -0.1017 -0.3053 -0.1837 -0.2708 -0.0748 -0.1189 0.0819 0.1214 0.1223 0.0998 0.1093 0.1021 0.1022 0.0901 0.1424 0.1391 0.1187 0.0989 0.1204 0.1587 0.0994 0.0923 0.0753 0.1490 0.1500 0.1119 0.0888 0.1101
va: 1.1208 1.9064 1.9765 2.9946 3.7320 3.4255 3.7708 3.9493 3.8411 3.9462 3.8784 4.0880 3.7863 3.8282 3.9299 3.9445 3.9097 4.0072 3.9006 1.0277 0.9996 0.9811 0.9935 1.0064 1.0151 0.9987 1.0063 0.9973 0.9980 0.9943 1.0078 0.9938 0.9899 1.0041 1.0041 1.0171 1.0050 1.0016 0.9909 0.9868 0.9931
dispcorr: -0.025659902 hartree
energy: -1250.371711585668
dipole: -14.93603 15.26101 0.32498 -21.59251 19.05470 -2.53780 -10.23352 8.33942 -1.89410
magnitude: 3.18334 au
magnitude: 8.09142 debye
