program: Orca
programVersion: 5.0.2
elementType: Cl O O N C C C C C C C C C C C C C C C H H H H H H H H H H H H H H H H H H H H H H
charge: 0
multiplicity: 1
keywords: wb97x-d3
keywords: def2-TZVPP
keywords: def2/J RIJCOSX
keywords: DEFGRID2
keywords: scfconv7
keywords: smallprint printgap noloewdin
keywords: NOSOSCF
formula: C15H22ClNO2
InChI: InChI=1/C15H22ClNO2/c1-5-13-8-6-7-11(2)15(13)17(14(18)9-16)12(3)10-19-4/h6-8,12H,5,9-10H2,1-4H3
41 atoms
Cl 0.873602 2.954996 2.281335
O  -2.455797 1.385767 -1.679307
O  -1.450127 1.545272 1.357051
N  -0.490835 -0.028951 0.03178
C  -1.792465 -0.60183 -0.367677
C  0.720902 -0.634599 -0.42679
C  1.312675 -1.649067 0.347123
C  -2.30185 -0.009107 -1.681592
C  1.304891 -0.209424 -1.627468
C  -1.761714 -2.116128 -0.50716
C  0.801502 -2.033484 1.714616
C  -0.459314 1.034497 0.871446
C  2.458381 -2.269438 -0.140517
C  2.449594 -0.863098 -2.078485
C  0.796905 0.950761 -2.433367
C  3.014557 -1.894283 -1.352287
C  0.701821 -3.535903 1.955207
C  0.938546 1.564132 1.176427
C  -3.673241 1.827304 -1.127197
H  -2.492211 -0.359145 0.432903
H  -1.60378 -0.258478 -2.484803
H  -3.251231 -0.504499 -1.928427
H  -2.767655 -2.464179 -0.74501
H  -1.4694 -2.608115 0.417346
H  -1.102126 -2.455518 -1.306598
H  1.478071 -1.603395 2.460707
H  -0.168285 -1.576765 1.906576
H  2.934345 -3.049494 0.440329
H  2.90635 -0.543483 -3.007753
H  0.332057 0.617228 -3.362915
H  0.071607 1.561733 -1.904005
H  1.628858 1.598072 -2.714173
H  3.905099 -2.390871 -1.716307
H  0.251582 -3.730278 2.929299
H  1.677188 -4.022269 1.950605
H  0.084951 -4.02641 1.2010
H  1.560898 0.801975 1.643279
H  1.439283 1.889559 0.26518
H  -3.805039 1.534808 -0.081126
H  -4.533864 1.452529 -1.694079
H  -3.68323 2.91633 -1.175134
elementType: Cl O N C H
totalener: -1250.35476138 hartree
nucrepener: 1707.60690259 hartree
electener: -2957.96166397 hartree
oneelecener: -5102.95778789 hartree
twoeener: 2144.99612392 hartree
cpcmener: -0.02883903 hartree
kineticenergy: 1246.01129564 hartree
xcener: -99.067031627198 hartree
chargesum: -0.0000000
charge: -0.154446 -0.383564 -0.486421 0.010658 0.135159 0.043539 -0.139063 -0.029789 -0.113752 -0.325508 -0.163220 0.293610 -0.074661 -0.096185 -0.327428 -0.182885 -0.271939 -0.078060 -0.113853 0.081634 0.116631 0.103775 0.111400 0.115006 0.106669 0.097181 0.090242 0.142433 0.136979 0.117456 0.099028 0.119076 0.155660 0.097133 0.090231 0.085646 0.148278 0.145122 0.089646 0.093095 0.115488
qa: -0.1544 -0.3836 -0.4864 0.0107 0.1352 0.0435 -0.1391 -0.0298 -0.1138 -0.3255 -0.1632 0.2936 -0.0747 -0.0962 -0.3274 -0.1829 -0.2719 -0.0781 -0.1139 0.0816 0.1166 0.1038 0.1114 0.1150 0.1067 0.0972 0.0902 0.1424 0.1370 0.1175 0.0990 0.1191 0.1557 0.0971 0.0902 0.0856 0.1483 0.1451 0.0896 0.0931 0.1155
va: 1.1244 1.9105 2.0215 2.9214 3.7187 3.6115 3.8040 3.9263 3.7998 3.9594 3.8772 4.1349 3.8142 3.8452 3.9227 3.9605 3.9270 3.9997 3.9016 1.0238 0.9844 1.0026 1.0073 0.9956 0.9968 0.9958 1.0051 0.9987 1.0001 0.9906 1.0287 0.9961 0.9923 1.0032 1.0021 1.0035 1.0035 1.0036 0.9914 0.9933 0.9915
dispcorr: -0.024183593 hartree
energy: -1250.378944972837
dipole: -8.05308 8.71761 0.66452 -20.65824 18.23782 -2.42042 -10.97730 9.69065 -1.28665
magnitude: 2.82055 au
magnitude: 7.16926 debye
