program: Orca
programVersion: 5.0.2
elementType: Cl O O N C C C C C C C C C C C C C C C H H H H H H H H H H H H H H H H H H H H H H
charge: 0
multiplicity: 1
keywords: wb97x-d3
keywords: def2-TZVPP
keywords: def2/J RIJCOSX
keywords: DEFGRID2
keywords: scfconv7
keywords: smallprint printgap noloewdin
keywords: NOSOSCF
formula: C15H22ClNO2
InChI: InChI=1/C15H22ClNO2/c1-5-13-8-6-7-11(2)15(13)17(14(18)9-16)12(3)10-19-4/h6-8,12H,5,9-10H2,1-4H3
41 atoms
Cl 1.33767 1.685257 2.70482
O  -3.797303 0.300789 -1.719937
O  -1.494196 1.931701 1.157141
N  -0.472567 0.325966 -0.065385
C  -1.784606 -0.247181 -0.436028
C  0.741162 -0.337824 -0.425286
C  1.261916 -1.320708 0.427285
C  -2.442281 0.621387 -1.521563
C  1.383483 0.006564 -1.62252
C  -1.693508 -1.68903 -0.89916
C  0.614464 -1.691963 1.739618
C  -0.472057 1.431649 0.71392
C  2.443299 -1.956998 0.051139
C  2.559119 -0.656217 -1.959025
C  0.858354 1.071472 -2.538746
C  3.084574 -1.634148 -1.131266
C  0.479007 -3.193817 1.967911
C  0.86311 2.084761 1.025241
C  -4.662301 0.830601 -0.743724
H  -2.400546 -0.223067 0.466279
H  -2.331247 1.68718 -1.289468
H  -1.940438 0.440914 -2.474954
H  -1.304971 -2.352648 -0.129057
H  -1.082146 -1.80411 -1.795286
H  -2.69787 -2.038585 -1.139241
H  1.210338 -1.266637 2.551204
H  -0.368695 -1.230416 1.827247
H  2.874113 -2.711932 0.696836
H  3.07089 -0.394184 -2.877289
H  0.37567 1.890987 -2.007703
H  1.668444 1.493688 -3.133115
H  0.126552 0.667666 -3.241677
H  4.003224 -2.138121 -1.40385
H  -0.080691 -3.678982 1.16695
H  -0.051134 -3.382865 2.902131
H  1.445896 -3.69146 2.042855
H  1.681627 1.796613 0.372929
H  0.732404 3.164132 0.971765
H  -4.523363 0.382678 0.245896
H  -5.684464 0.623838 -1.062312
H  -4.548766 1.916364 -0.642109
elementType: Cl O N C H
totalener: -1250.35336229 hartree
nucrepener: 1706.35865742 hartree
electener: -2956.71201971 hartree
oneelecener: -5100.06109373 hartree
twoeener: 2143.34907402 hartree
cpcmener: -0.02638478 hartree
kineticenergy: 1246.01069729 hartree
xcener: -99.063170111903 hartree
chargesum: 0.0000000
charge: -0.157946 -0.391565 -0.500127 0.016771 0.100444 0.005494 -0.126533 -0.018493 -0.092194 -0.305428 -0.172711 0.299457 -0.083729 -0.066597 -0.308453 -0.183463 -0.265619 -0.080413 -0.109486 0.090680 0.112330 0.106112 0.116313 0.101768 0.103934 0.084532 0.094384 0.141919 0.137881 0.104023 0.112114 0.112924 0.155954 0.085314 0.094796 0.089458 0.142713 0.152219 0.089948 0.118489 0.092784
qa: -0.1579 -0.3916 -0.5001 0.0168 0.1004 0.0055 -0.1265 -0.0185 -0.0922 -0.3054 -0.1727 0.2995 -0.0837 -0.0666 -0.3085 -0.1835 -0.2656 -0.0804 -0.1095 0.0907 0.1123 0.1061 0.1163 0.1018 0.1039 0.0845 0.0944 0.1419 0.1379 0.1040 0.1121 0.1129 0.1560 0.0853 0.0948 0.0895 0.1427 0.1522 0.0899 0.1185 0.0928
va: 1.1173 1.9271 2.0097 2.9261 3.6414 3.6377 3.7840 3.9213 3.7947 3.9417 3.8671 4.1288 3.8183 3.8131 3.9356 3.9634 3.9365 3.9817 3.9075 1.0168 1.0106 1.0019 1.0005 0.9979 1.0238 1.0145 1.0021 0.9992 1.0011 1.0017 1.0023 0.9920 0.9919 1.0044 1.0040 1.0022 1.0112 1.0040 0.9826 0.9910 0.9937
dispcorr: -0.024602074 hartree
energy: -1250.377964365952
dipole: -10.07788 11.24578 1.16791 -13.00786 12.23981 -0.76805 -12.03089 10.82405 -1.20684
magnitude: 1.84672 au
magnitude: 4.69398 debye
