program: Gaussian 09
title: 000006406
version: EM64L-G09RevD.01
frameworkgroup: C1[X(C4H7NO)]
method: RPBEPBE
basis: SDD
operation: Freq
keyword: #pfreq=noraman
keyword: PBEPBE/SDD
title: #p freq=noraman PBEPBE/SDD
converged: NO NO NO NO
title: Mulliken charges:
elementType: O N C C C C H H H H H H H
charge: -0.432357 -0.005639 0.235682 -0.682614 -0.665300 -0.192752 0.241900 0.222742 0.231222 0.235669 0.250076 0.215459 0.345911
chargesum: 0.00000
title: Mulliken charges with hydrogens summed into heavy atoms:
elementType: O N C C C C
charge: -0.086446 -0.005639 0.235682 0.013250 0.035904 -0.192752
polarizability: 6.01436589e+01 4.31949651e-01 4.51423790e+01 6.01808002e-01 -1.40044813e+00 4.44686388e+01
1716.lowfreq: -18.7403 -0.0004 0.0008 0.0009 0.3601 20.7581 178.2337 178.6542 194.9360
frequency: 178.2198 178.6268 194.9238 257.2090 337.2998 348.8105 382.0191 393.6728 565.4678 571.1327 679.1342 847.5874 933.1141 937.4454 1003.3776 1101.2145 1165.1605 1207.0998 1318.1840 1378.2975 1397.3190 1452.0884 1458.6823 1470.5592 1481.0252 2171.0683 2986.5339 3005.1273 3085.8655 3101.3212 3111.6611 3118.0142 3542.5960
redmass: 3.3141 2.7924 1.2204 1.1387 1.5463 1.4549 3.2755 3.4069 5.2956 6.6252 4.6168 2.8774 1.5359 2.2869 1.2949 1.6366 2.3614 2.5773 1.7681 1.2022 1.2023 1.0504 1.0480 1.0579 1.0500 12.6624 1.0354 1.0348 1.0999 1.1011 1.1006 1.1012 1.0661
irintensity: 3.9815 2.0077 2.9255 3.1101 52.0567 94.9413 19.5856 8.2365 5.9027 5.5587 5.2319 19.4854 2.5473 29.5662 2.3202 58.9710 49.5792 53.9353 42.8437 23.2167 14.3859 6.4351 1.7366 7.3376 17.1016 1.0580 12.2626 8.8933 22.2070 6.7281 24.6051 15.9273 8.3569
temp: 298.150 k
press: 1.00000 atm
elementType: 8 7 6 6 6 6 1 1 1 1 1 1 1
symmnumber: 1
zpe: 271312.2 jmol-1
zpe.correction: 0.103337 hartree
zpe.thermalcorrener: 0.110571 hartree
zpe.thermalcorrenthalpy: 0.111515 hartree
zpe.thermalcorrgfe: 0.073038 hartree
zpe.sumelectzpe: -286.097121 hartree
zpe.sumelectthermal: -286.089888 hartree
zpe.sumelectthermalent: -286.088944 hartree
zpe.sumelectthermalfe: -286.127421 hartree
dipole: 2.9884 -1.4454 -0.8572
dipole: 3.4285
quadrupole: -46.6468 -33.4360 -35.2029
quadrupole: -0.4157 -2.4009 -3.1413
quadrupole: -8.2183 4.9926 3.2257 -0.4157 -2.4009 -3.1413
hfenergy: -286.2004586 hartree
pointgroup: C01 [X(C4H7N1O1)]
dipole: -1.1816073 0.5591937 -0.3325286 debye
dipolederiv: -0.5890726 0.1808311 0.0186087 0.1753148 -0.2671994 0.0415602 0.0811636 0.0644755 -0.769978 -0.2893323 0.0035645 0.0015348 -0.0120233 -0.2004711 -0.0024589 -0.0075511 0.0009556 -0.1974309 0.593496 -0.0816533 -0.0306887 -0.079378 0.4657131 0.0145629 -0.0740813 -0.0037441 0.7744312 -0.0616446 0.0602121 -0.019143 0.0185252 -0.0858658 0.1105658 0.0106743 0.0340984 -0.0426196 -0.0429153 -0.03585 -0.0301619 0.0115979 -0.0640034 -0.0594071 0.0117778 -0.0010454 0.0222896 -0.0154729 0.0181703 0.0531453 0.0281023 -0.1391831 0.0000973 -0.0304604 -0.0107817 -0.1817141 -0.1243299 0.0194912 -0.0027906 -0.0012053 0.080131 0.0174376 0.0081876 0.0145244 0.1035211 0.0729748 -0.071675 -0.060157 -0.0482324 -0.0803816 -0.0603575 -0.0455836 -0.1027562 0.0287892 0.0903759 0.0115091 0.0641184 0.0116357 0.0909348 -0.0114813 0.0510714 0.0208211 -0.108163 -0.1246086 -0.0092679 -0.0051991 0.0048413 0.084616 -0.0205234 0.0019905 -0.0133618 0.109302 0.0857336 0.0605178 -0.0489448 0.0462215 -0.0546912 0.0554554 -0.0365904 0.0842856 0.0616174 0.0858891 -0.0077135 0.0725299 -0.0128947 0.0917036 0.0194755 0.0518638 -0.0217981 -0.1030769 0.318907 -0.1481365 -0.012852 -0.1425049 0.0786971 -0.1049263 -0.0224619 -0.0656731 0.3030319 unknown
polarizability: 60.13608|0.6863|45.0738827|-0.4388216|1.4163743|44.544714 unknown
InChI: InChI=1S/C4H7NO/c1-4(2,6)3-5/h6H,1-2H3
charge 0 multiplicity 1
13 atoms
O  -0.890218 -0.057851 1.400418
N  2.251419 0.02822 -0.066726
C  -0.438916 0.010847 -0.002657
C  -0.972315 1.291755 -0.690838
C  -0.984502 -1.274905 -0.655523
C  1.057122 0.013146 -0.045442
H  -2.074469 1.29433 -0.624903
H  -0.58335 2.203067 -0.199945
H  -0.67574 1.322584 -1.753402
H  -2.086009 -1.263301 -0.592569
H  -0.61108 -2.163071 -0.120575
H  -0.679375 -1.335435 -1.713735
H  -0.598067 0.760913 1.879698
