program: Orca
programVersion: 5.0.2
elementType: Cl O O N C C C C C C C C C C C C C C C H H H H H H H H H H H H H H H H H H H H H H
charge: 0
multiplicity: 1
keywords: wb97x-d3
keywords: def2-TZVPP
keywords: def2/J RIJCOSX
keywords: DEFGRID2
keywords: scfconv7
keywords: smallprint printgap noloewdin
keywords: NOSOSCF
formula: C15H22ClNO2
InChI: InChI=1/C15H22ClNO2/c1-5-13-8-6-7-11(2)15(13)17(14(18)9-16)12(3)10-19-4/h6-8,12H,5,9-10H2,1-4H3
41 atoms
Cl 0.910068 2.461549 2.614357
O  -3.61867 -0.894967 -0.610217
O  -1.012438 2.277943 0.37302
N  -0.201743 0.300433 -0.370353
C  -1.458572 -0.069629 -1.043667
C  0.938582 -0.51181 -0.636527
C  1.054169 -1.752729 0.007488
C  -2.676052 0.024253 -0.120303
C  1.909093 -0.079467 -1.547249
C  -1.678061 0.670065 -2.356128
C  0.059009 -2.224916 1.034417
C  -0.10913 1.477099 0.309984
C  2.158578 -2.54588 -0.273122
C  3.004612 -0.903976 -1.793172
C  1.848645 1.249655 -2.24636
C  3.131503 -2.127456 -1.166028
C  0.294656 -1.615298 2.415566
C  1.21639 1.742231 1.020516
C  -4.839605 -0.830553 0.066202
H  -1.344091 -1.13071 -1.278166
H  -2.38961 -0.221952 0.913491
H  -3.086914 1.039163 -0.107764
H  -0.888066 0.447354 -3.073429
H  -1.726541 1.747583 -2.203599
H  -2.619897 0.346365 -2.798566
H  -0.965222 -2.026927 0.717375
H  0.136366 -3.311426 1.110989
H  2.257156 -3.505309 0.220092
H  3.76207 -0.576921 -2.495176
H  0.858355 1.696482 -2.246096
H  2.532091 1.965868 -1.784282
H  2.160378 1.1482 -3.28592
H  3.985514 -2.758541 -1.373608
H  1.309392 -1.81243 2.763215
H  -0.394558 -2.042335 3.144659
H  0.144697 -0.535978 2.424235
H  1.82143 0.851449 1.166503
H  1.797277 2.459305 0.439392
H  -5.508274 -1.567902 -0.376717
H  -5.310755 0.157268 -0.0168
H  -4.736512 -1.059546 1.13512
totalener: -1250.33329551 hartree
nucrepener: 1696.42423025 hartree
electener: -2946.75752576 hartree
oneelecener: -5080.10668813 hartree
twoeener: 2133.34916237 hartree
kineticenergy: 1246.07587210 hartree
xcener: -99.067956793094 hartree
chargesum: -0.0000000
charge: -0.117283 -0.327546 -0.374320 0.019597 0.093247 0.061365 -0.121889 -0.001398 -0.146662 -0.337839 -0.173926 0.222741 -0.032399 -0.046463 -0.337676 -0.146404 -0.249031 -0.113324 -0.115058 0.081517 0.085136 0.115042 0.094305 0.103812 0.109620 0.089020 0.079071 0.110012 0.109916 0.123461 0.107762 0.110753 0.126979 0.091352 0.094202 0.075831 0.138355 0.131926 0.106698 0.081824 0.077673
qa: -0.1173 -0.3275 -0.3743 0.0196 0.0932 0.0614 -0.1219 -0.0014 -0.1467 -0.3378 -0.1739 0.2227 -0.0324 -0.0465 -0.3377 -0.1464 -0.2490 -0.1133 -0.1151 0.0815 0.0851 0.1150 0.0943 0.1038 0.1096 0.0890 0.0791 0.1100 0.1099 0.1235 0.1078 0.1108 0.1270 0.0914 0.0942 0.0758 0.1384 0.1319 0.1067 0.0818 0.0777
va: 1.1544 1.9507 2.1332 2.8750 3.7858 3.7484 3.8984 3.8577 3.9149 3.9253 3.9553 4.1409 3.8560 3.8937 3.9487 4.0183 3.8922 4.0450 3.9488 1.0223 0.9930 1.0083 0.9947 1.0106 1.0197 0.9982 1.0101 1.0094 1.0080 0.9944 0.9935 0.9995 1.0010 1.0042 1.0094 1.0237 0.9982 1.0115 0.9949 0.9920 0.9889
dispcorr: -0.023870173 hartree
energy: -1250.357165683909
dipole: -9.35556 9.99881 0.64325 -12.44226 11.30932 -1.13294 -10.12965 9.43849 -0.69117
magnitude: 1.47480 au
magnitude: 3.74865 debye
