program: Orca
programVersion: 5.0.2
elementType: Cl O O N C C C C C C C C C C C C C C C H H H H H H H H H H H H H H H H H H H H H H
charge: 0
multiplicity: 1
keywords: wb97x-d3
keywords: def2-TZVPP
keywords: def2/J RIJCOSX
keywords: DEFGRID2
keywords: scfconv7
keywords: smallprint printgap noloewdin
keywords: NOSOSCF
formula: C15H22ClNO2
InChI: InChI=1/C15H22ClNO2/c1-5-13-8-6-7-11(2)15(13)17(14(18)9-16)12(3)10-19-4/h6-8,12H,5,9-10H2,1-4H3
41 atoms
Cl 1.692213 2.755717 1.064845
O  -2.982462 -0.563903 0.608788
O  -1.473159 2.198925 0.298991
N  -0.448243 0.2651 -0.304034
C  -1.498767 -0.155713 -1.241549
C  0.775998 -0.472596 -0.327736
C  0.896054 -1.643843 0.435799
C  -2.916655 -0.040676 -0.684912
C  1.838924 -0.02263 -1.121998
C  -1.43401 0.555688 -2.588445
C  -0.198935 -2.153333 1.333608
C  -0.583324 1.390314 0.447976
C  2.08557 -2.359552 0.377086
C  3.012115 -0.772426 -1.149765
C  1.794142 1.227764 -1.954485
C  3.138316 -1.933689 -0.413063
C  -0.93957 -3.351771 0.743919
C  0.437441 1.587392 1.561991
C  -4.184883 -0.270949 1.260219
H  -1.300682 -1.216834 -1.411181
H  -3.254035 0.999778 -0.71039
H  -3.568708 -0.608045 -1.368237
H  -1.532907 1.633994 -2.470571
H  -2.244637 0.211428 -3.232985
H  -0.500677 0.345325 -3.106167
H  0.248016 -2.449876 2.286221
H  -0.917699 -1.368281 1.555044
H  2.188267 -3.257964 0.974455
H  3.839677 -0.427044 -1.757767
H  0.928103 1.852873 -1.763992
H  2.677387 1.836587 -1.766044
H  1.79415 0.97799 -3.017246
H  4.060563 -2.499067 -0.442689
H  -0.261513 -4.182727 0.546892
H  -1.42986 -3.095779 -0.194207
H  -1.710757 -3.702198 1.429524
H  -0.086218 2.019176 2.411939
H  0.942254 0.676468 1.870919
H  -5.053505 -0.707868 0.751022
H  -4.349074 0.809617 1.34582
H  -4.13235 -0.69264 2.26326
totalener: -1250.33196966 hartree
nucrepener: 1730.99905952 hartree
electener: -2981.33102918 hartree
oneelecener: -5149.78763844 hartree
twoeener: 2168.45660926 hartree
kineticenergy: 1246.08764723 hartree
xcener: -99.071900456900 hartree
chargesum: 0.0000000
charge: -0.129524 -0.317935 -0.389165 0.040614 0.067281 0.099109 -0.124489 -0.002063 -0.159779 -0.318418 -0.184682 0.222451 -0.030156 -0.058944 -0.342276 -0.158591 -0.243268 -0.082080 -0.116676 0.087475 0.106706 0.080311 0.109695 0.095190 0.101208 0.091579 0.089284 0.113614 0.110669 0.108667 0.112807 0.111957 0.124710 0.080722 0.077406 0.086987 0.140615 0.124879 0.082872 0.097360 0.093879
qa: -0.1295 -0.3179 -0.3892 0.0406 0.0673 0.0991 -0.1245 -0.0021 -0.1598 -0.3184 -0.1847 0.2225 -0.0302 -0.0589 -0.3423 -0.1586 -0.2433 -0.0821 -0.1167 0.0875 0.1067 0.0803 0.1097 0.0952 0.1012 0.0916 0.0893 0.1136 0.1107 0.1087 0.1128 0.1120 0.1247 0.0807 0.0774 0.0870 0.1406 0.1249 0.0829 0.0974 0.0939
va: 1.1451 1.9709 2.1118 2.8398 3.8404 3.6848 3.8338 3.8716 3.8481 3.9540 3.8431 4.1991 3.8436 3.9079 3.9506 4.0317 3.9327 4.0060 3.9390 0.9963 1.0064 0.9969 1.0120 1.0102 0.9966 0.9977 1.0484 1.0050 1.0058 1.0024 1.0021 0.9911 1.0015 1.0079 1.0092 1.0078 1.0057 1.0114 0.9889 0.9935 0.9959
dispcorr: -0.024973639 hartree
energy: -1250.356943296885
dipole: -14.84233 14.72546 -0.11687 -16.64627 15.40339 -1.24288 -7.01962 6.77790 -0.24173
magnitude: 1.27155 au
magnitude: 3.23203 debye
