program: Gaussian 09
title: 000056029
version: EM64L-G09RevD.01
frameworkgroup: C1[X(C7H8N4O5)]
method: RPBEPBE
basis: SDD
operation: Freq
keyword: #pfreq=noraman
keyword: PBEPBE/SDD
title: #p freq=noraman PBEPBE/SDD
converged: YES YES NO NO
title: Mulliken charges:
elementType: O O O O O N N N N C C C C C C C H H H H H H H H
charge: -0.245406 -0.478037 -0.220681 -0.213818 -0.237067 0.039329 0.048749 -0.389130 -0.639356 0.299708 -0.003492 -0.312339 0.269468 -0.304733 -0.420551 0.290972 0.300024 0.293964 0.276018 0.258796 0.354321 0.367321 0.315644 0.350295
chargesum: 0.00000
title: Mulliken charges with hydrogens summed into heavy atoms:
elementType: O O O O O N N N N C C C C C C C
charge: -0.245406 -0.110716 -0.220681 -0.213818 -0.237067 0.039329 0.048749 -0.034809 0.026583 0.299708 -0.003492 -0.012315 0.269468 -0.010769 0.114264 0.290972
polarizability: 3.16717080e+02 -1.13991801e+00 1.30188868e+02 -8.87974014e-01 -3.27428072e+00 5.76454141e+01
1716.lowfreq: -5.9377 0.0003 0.0003 0.0004 1.7594 9.5646 33.8911 44.1931 58.9858
frequency: 33.8566 44.1926 58.9850 63.9012 98.0446 119.2072 129.5121 149.9497 209.3598 222.7489 250.1582 266.7261 312.4630 335.7921 396.0013 402.2957 421.5833 434.0197 490.7102 516.2655 529.5568 555.4988 561.0892 637.8467 663.0590 676.5644 713.8453 730.8156 766.3340 781.9040 828.9917 887.1297 914.5556 917.5319 926.8286 934.9744 951.8072 1016.2444 1045.2096 1055.0994 1129.0577 1158.8553 1175.2178 1204.3388 1254.7999 1292.2580 1298.8986 1324.5727 1337.5476 1352.9975 1377.2878 1459.0078 1482.5600 1513.0331 1529.6747 1567.4841 1610.2418 1688.2386 3019.9183 3090.9757 3243.0971 3260.1893 3269.7233 3536.4309 3580.8832 3692.0696
redmass: 7.5972 4.8754 7.0081 10.1482 6.1769 3.7957 6.1047 5.4836 5.8819 5.3005 7.4568 7.9572 2.1459 5.4854 1.7994 1.2253 5.7358 5.2839 4.6646 1.2624 3.0985 6.1059 5.2912 6.0701 5.0022 8.2600 9.7555 12.6703 1.3881 4.1755 1.3215 7.2419 1.4284 5.2075 3.2474 2.5058 2.6939 1.3547 2.3499 2.6594 4.2473 1.3899 4.0124 2.6286 4.0101 3.1819 4.1139 1.4369 5.5971 1.4471 3.6946 1.0863 2.6452 2.8471 6.5214 6.0148 1.2015 5.6606 1.0592 1.1060 1.0947 1.1048 1.0789 1.0460 1.0666 1.1039
irintensity: 5.0250 12.9464 9.0416 1.4535 1.8890 7.9408 4.4951 4.6513 2.8236 4.4218 0.2146 3.3202 15.2796 3.6087 58.4471 139.6142 9.6957 15.0995 3.6339 217.3890 22.4144 0.6732 0.5354 17.9253 9.5730 9.8328 33.8498 15.2537 102.4188 28.5517 59.9493 15.2197 3.9009 12.7151 60.6682 65.6521 18.1399 65.2846 24.3252 14.5591 83.6834 209.1503 154.6461 166.6432 781.6147 428.5350 240.9146 46.4928 68.3423 36.7309 32.7034 14.6575 688.8400 7.0713 212.8624 16.1372 96.6445 255.5333 12.8654 2.9668 0.4975 6.6893 109.8122 100.2057 19.4937 53.6114
temp: 298.150 k
press: 1.00000 atm
elementType: 8 8 8 8 8 7 7 7 7 6 6 6 6 6 6 6 1 1 1 1 1 1 1 1
symmnumber: 1
zpe: 433646.4 jmol-1
zpe.correction: 0.165167 hartree
zpe.thermalcorrener: 0.180520 hartree
zpe.thermalcorrenthalpy: 0.181464 hartree
zpe.thermalcorrgfe: 0.121021 hartree
zpe.sumelectzpe: -865.347203 hartree
zpe.sumelectthermal: -865.331850 hartree
zpe.sumelectthermalent: -865.330906 hartree
zpe.sumelectthermalfe: -865.391350 hartree
dipole: 6.7714 2.8961 0.7130
dipole: 7.3992
quadrupole: -105.9060 -94.6941 -88.4947
quadrupole: 23.4843 -0.2484 2.2558
quadrupole: -9.5411 1.6708 7.8702 23.4843 -0.2484 2.2558
hfenergy: -865.5123703 hartree
pointgroup: C01 [X(C7H8N4O5)]
dipole: -2.6355809 1.2049858 -0.2755622 debye
dipolederiv: -0.0092227 0.0048964 -0.0002367 -0.1485952 -0.5460648 -0.0349256 -0.0245251 -0.0360823 -0.0901017 -0.3680993 0.0361258 -0.2005553 0.1034426 -0.8401579 0.100658 -0.1924739 0.1873048 -0.3739452 -1.2299754 0.1591681 0.023588 0.4829807 -0.5411961 -0.028033 0.057983 -0.0254483 -0.2477258 -0.6287604 -0.1058267 -0.0033628 -0.6441896 -0.7836601 -0.0354962 -0.0393448 -0.0376411 -0.2346239 -0.8166775 -0.0707533 0.0058511 -0.5124288 -1.0340479 -0.0114064 0.0054342 -0.0156919 -0.3598603 1.9032299 0.0617353 -0.0172306 -0.3793806 -0.270159 -0.0171687 -0.1661907 -0.0511913 -0.0894692 2.6508347 0.1414166 -0.0201978 0.6249316 1.1547142 0.0652725 -0.0039132 0.0678288 0.2101428 -2.7701005 -0.277084 0.0140089 0.148285 -0.3880457 -0.0232072 0.1612743 -0.0168586 -0.2983638 -1.598648 0.3647488 0.0163084 0.4774704 -0.4918197 0.0333274 -0.009318 0.0330158 -0.7586142 0.8040937 -0.1337058 -0.0093436 -0.6963374 0.2428015 0.0243557 -0.0560423 0.0330357 0.0564668 -0.9909246 -0.0612397 -0.0287971 -0.5035244 0.1890556 0.0914773 0.0498347 0.0727761 -0.078376 -0.5640665 0.084091 0.0084486 0.7106829 -0.1055577 -0.0002174 0.0710734 -0.0037719 -0.1624684 -1.3957292 -0.2080373 -0.0019942 -0.7545285 0.0924174 0.0144942 -0.0236972 0.006096 0.0658413 0.6443686 0.0038487 -0.0106951 0.3273998 0.0493361 0.0090817 0.0135928 0.011825 -0.1059227 0.2030005 -0.1037781 0.1250677 -0.0560674 0.4209892 -0.1286696 0.0950741 -0.1729673 0.4424472 3.2128566 -0.0078219 -0.0107371 0.9889613 1.5175836 0.0287515 0.0232674 0.0269485 0.3393553 0.0674137 -0.0504918 -0.0020293 -0.0320487 0.1123132 -0.0066715 -0.0002485 -0.0048741 0.1906615 0.0888251 0.046686 0.0055008 0.0167337 0.1081128 -0.0074968 0.0017697 -0.0070066 0.194879 -0.0331881 -0.0688698 -0.0252334 -0.0152464 0.0817989 0.0329766 0.0022102 0.034023 0.0849059 0.0797722 0.0829493 0.0674276 -0.0067828 0.0317826 -0.0039085 0.0088523 -0.0109842 -0.0572398 0.0132694 0.1138221 -0.0274763 -0.0837122 0.3160156 -0.0295494 -0.0767937 -0.0422564 0.3348866 0.1929106 0.0188909 0.0982012 -0.0062452 0.3987839 -0.047005 0.0897918 -0.0175737 0.1326908 0.2551896 -0.0197064 -0.0071155 -0.0843344 0.1143498 -0.0164715 0.0067188 -0.0213105 0.4020344 0.2896278 -0.0110643 0.0006026 0.0425336 0.1706544 -0.010168 0.0056706 -0.0091955 0.4023993 unknown
polarizability: 316.6441311|-3.5696576|130.2824278|-1.8804241|2.9385203|57.6248031 unknown
InChI: InChI=1S/C7H8N4O5/c8-7(13)10-9-4(3-12)5-1-2-6(16-5)11(14)15/h1-2,10,12H,3,8H2
charge 0 multiplicity 1
24 atoms
O  1.744028 0.463864 0.078362
O  -1.708869 2.62185 -0.448588
O  5.091646 -0.809414 -0.086607
O  4.304611 1.349949 0.089937
O  -4.193914 -1.777573 0.020943
N  -1.787065 -0.350114 0.036871
N  4.134302 0.068195 -0.001484
N  -3.00009 0.274463 0.089729
N  -5.33406 0.261667 0.066807
C  0.56294 -0.311919 0.038372
C  -0.692856 0.408839 0.116297
C  0.899274 -1.671107 -0.076532
C  2.80378 -0.450025 -0.014122
C  2.324231 -1.756203 -0.109066
C  -0.682658 1.916825 0.362764
C  -4.185908 -0.52448 0.053681
H  0.178618 -2.48317 -0.128111
H  2.940886 -2.647304 -0.191771
H  0.321363 2.341343 0.197006
H  -0.98235 2.126943 1.405531
H  -3.030711 1.306903 -0.014369
H  -1.400289 2.696002 -1.38605
H  -5.329333 1.277654 0.136273
H  -6.225474 -0.227887 0.048527
