program: Orca
programVersion: 5.0.2
elementType: Cl O N N N C C C C C C C C C C C C C C H H H H H H H H H H H H H H H H
charge: 0
multiplicity: 1
keywords: wb97x-d3
keywords: def2-TZVPP
keywords: def2/J RIJCOSX
keywords: DEFGRID2
keywords: scfconv7
keywords: smallprint printgap noloewdin
keywords: NOSOSCF
formula: C14H16ClN3O
InChI: InChI=1/C14H16ClN3O/c1-11-5-3-6-12(2)14(11)18(13(19)9-15)10-17-8-4-7-16-17/h3-8H,9-10H2,1-2H3
35 atoms
Cl 2.330963 -2.140396 1.115193
O  -0.277636 -2.761047 -0.711639
N  -0.203539 -0.499129 -0.765305
N  -2.428913 -0.251701 0.157523
N  -2.801033 0.960927 0.572087
C  0.52904 0.715298 -0.59166
C  -1.625126 -0.394032 -1.029268
C  0.997442 1.37027 -1.739803
C  0.734893 1.232719 0.688088
C  0.36804 -1.725328 -0.684651
C  1.678998 2.569209 -1.584847
C  1.428481 2.438991 0.798801
C  0.795927 0.778071 -3.101925
C  0.244203 0.574523 1.943237
C  1.891952 3.10285 -0.320943
C  -2.790342 -1.222443 1.022557
C  1.879162 -1.781901 -0.579782
C  -3.451222 -0.605083 2.05462
C  -3.428202 0.757971 1.713947
H  -1.957944 -1.269176 -1.581239
H  -1.807188 0.482729 -1.645339
H  2.054314 3.084271 -2.460221
H  1.600955 2.856149 1.783587
H  1.312793 1.370023 -3.856996
H  1.178141 -0.244225 -3.161344
H  -0.260712 0.740576 -3.380521
H  1.038906 0.539668 2.687977
H  -0.573771 1.151104 2.377772
H  -0.112729 -0.440976 1.796544
H  2.426396 4.037712 -0.212752
H  -2.563593 -2.260422 0.841816
H  2.235502 -2.603244 -1.197748
H  2.388839 -0.869297 -0.872072
H  -3.894098 -1.067813 2.92048
H  -3.847953 1.590226 2.257784
elementType: Cl O N C H
totalener: -1242.89346845 hartree
nucrepener: 1624.83008828 hartree
electener: -2867.72355673 hartree
oneelecener: -4926.69082908 hartree
twoeener: 2058.96727234 hartree
cpcmener: -0.03298949 hartree
kineticenergy: 1238.77264732 hartree
xcener: -97.691945551558 hartree
chargesum: 0.0000000
charge: -0.154809 -0.520386 0.001037 0.117246 -0.345594 0.122015 0.001778 -0.151527 -0.167690 0.332455 -0.060587 -0.092200 -0.254936 -0.324344 -0.181895 -0.079688 -0.076797 -0.243965 -0.105788 0.142631 0.144136 0.142277 0.143002 0.103499 0.103347 0.105769 0.122556 0.124966 0.083839 0.159365 0.174568 0.158884 0.146178 0.172457 0.158201
qa: -0.1548 -0.5204 0.0010 0.1172 -0.3456 0.1220 0.0018 -0.1515 -0.1677 0.3325 -0.0606 -0.0922 -0.2549 -0.3243 -0.1819 -0.0797 -0.0768 -0.2440 -0.1058 0.1426 0.1441 0.1423 0.1430 0.1035 0.1033 0.1058 0.1226 0.1250 0.0838 0.1594 0.1746 0.1589 0.1462 0.1725 0.1582
va: 1.1164 1.9801 2.9900 3.2515 2.8618 3.5211 3.8566 3.8962 3.8118 4.0714 3.7909 3.8353 3.9466 3.9378 3.9409 3.8973 3.9874 3.8891 4.0393 1.0135 1.0098 1.0008 0.9966 1.0041 0.9963 0.9961 1.0013 0.9966 1.0105 0.9895 1.0101 1.0017 1.0100 0.9898 1.0033
dispcorr: -0.021168309 hartree
energy: -1242.914636758026
dipole: -3.51830 4.20028 0.68199 10.28785 -9.26438 1.02346 -5.32444 4.28143 -1.04301
magnitude: 1.61259 au
magnitude: 4.09888 debye
