program: Orca
programVersion: 5.0.2
elementType: Cl O N N N C C C C C C C C C C C C C C H H H H H H H H H H H H H H H H
charge: 0
multiplicity: 1
keywords: wb97x-d3
keywords: def2-TZVPP
keywords: def2/J RIJCOSX
keywords: DEFGRID2
keywords: scfconv7
keywords: smallprint printgap noloewdin
keywords: NOSOSCF
formula: C14H16ClN3O
InChI: InChI=1/C14H16ClN3O/c1-11-5-3-6-12(2)14(11)18(13(19)9-15)10-17-8-4-7-16-17/h3-8H,9-10H2,1-2H3
35 atoms
Cl 2.419443 -2.956776 -1.304929
O  0.01876 -2.606396 0.256591
N  0.061255 -0.367983 0.573054
N  -2.338334 -0.174093 0.754674
N  -2.849359 1.054797 0.692843
C  0.638321 0.902131 0.270756
C  -1.09475 -0.402674 1.44418
C  0.272445 1.580858 -0.894731
C  1.554397 1.44227 1.184188
C  0.544091 -1.531004 0.05816
C  0.842703 2.831979 -1.127987
C  2.093045 2.694111 0.917292
C  -0.697186 1.030306 -1.898013
C  1.956454 0.687297 2.415806
C  1.737129 3.386596 -0.231198
C  -3.063962 -1.068578 0.052763
C  1.803291 -1.376837 -0.781289
C  -4.117238 -0.378334 -0.493395
C  -3.929095 0.944292 -0.055275
H  -0.99905 0.37712 2.196044
H  -1.140999 -1.364619 1.947379
H  0.575635 3.373305 -2.027908
H  2.803353 3.127144 1.610873
H  -0.334058 1.202633 -2.911575
H  -0.879395 -0.036929 -1.792766
H  -1.662481 1.532791 -1.816085
H  2.271624 -0.332503 2.189373
H  2.785294 1.184663 2.917674
H  1.139027 0.615786 3.136524
H  2.166964 4.36029 -0.429559
H  -2.787454 -2.109145 -0.001749
H  1.605918 -0.783598 -1.673747
H  2.589648 -0.875581 -0.217249
H  -4.910939 -0.770386 -1.107346
H  -4.543003 1.80969 -0.254978
elementType: Cl O N C H
totalener: -1242.90327928 hartree
nucrepener: 1601.09601250 hartree
electener: -2843.99929178 hartree
oneelecener: -4878.83325554 hartree
twoeener: 2034.83396376 hartree
cpcmener: -0.02910593 hartree
kineticenergy: 1238.77728858 hartree
xcener: -97.693305378432 hartree
chargesum: -0.0000000
charge: -0.147665 -0.469897 -0.017407 0.121497 -0.342692 0.143616 0.000347 -0.191206 -0.169645 0.299598 -0.080718 -0.052821 -0.317915 -0.256817 -0.183044 -0.082861 -0.074861 -0.240469 -0.107180 0.143518 0.140931 0.138986 0.139195 0.122089 0.097918 0.122333 0.102632 0.101907 0.104817 0.156224 0.175161 0.149333 0.150111 0.170001 0.154982
qa: -0.1477 -0.4699 -0.0174 0.1215 -0.3427 0.1436 0.0003 -0.1912 -0.1696 0.2996 -0.0807 -0.0528 -0.3179 -0.2568 -0.1830 -0.0829 -0.0749 -0.2405 -0.1072 0.1435 0.1409 0.1390 0.1392 0.1221 0.0979 0.1223 0.1026 0.1019 0.1048 0.1562 0.1752 0.1493 0.1501 0.1700 0.1550
va: 1.1288 2.0354 2.9720 3.2520 2.8631 3.4826 3.8574 3.8412 3.8982 4.1126 3.8311 3.7920 3.9485 3.9505 3.9532 3.9037 4.0145 3.8876 4.0423 1.0096 1.0144 0.9978 1.0014 0.9980 1.0024 0.9947 0.9958 1.0042 0.9962 0.9908 1.0077 1.0029 1.0006 0.9906 1.0040
dispcorr: -0.020221378 hartree
energy: -1242.923500659714
dipole: -4.28676 4.72899 0.44223 14.49083 -12.92135 1.56948 3.50766 -3.36598 0.14169
magnitude: 1.63674 au
magnitude: 4.16025 debye
